{"text_format":"1","workbook":"xlsx","n_sheets":35,"sheets":["START","Instructions","Template names","Lookup and lists","Org structure","Contacts","C1-Sum","C2-FinPerf SC","C2C","C3-FinPerf V","C3C","C4-FinPerf RE","C5-Capex","C5C","C6-FinPos","C7-CFlow","SC1","SC2","SC3","SC4","SC5","SC6","SC7(1)","SC7(2)","SC8","SC9","SC10","SC11","SC12","SC13a","SC13b","SC13c","SC13d","SC13e","SC71charts"],"not_rendered":{"charts":5,"images":17,"macros":1,"external_links":5,"defined_names":2031,"comments":0,"pivot_tables":0},"unopened":[],"bounds":{"document_bytes":16777216,"sheet_cells":100000,"rows_first":2000,"rows_last":500,"rows_between":2000,"halvings":0,"cell_chars":16384,"cell_head_chars":4096},"cells_cut":0,"cells_raw":0,"read":"whole","date_system":"1900"}

{"sheet":"START","index":0,"n_rows":1,"n_cols":1,"rows_kept":1,"cut":false,"hidden":false,"merged":[]}
[{"$f":"muni","v":"NW375 Moses Kotane"}]

{"sheet":"Instructions","index":1,"n_rows":55,"n_cols":25,"rows_kept":55,"cut":false,"hidden":false,"merged":[]}
[]
[null,null,null,2020]
[]
[null,null,null,null,null,null,null,null,null,null,null,null,null,null,null,null,null,null,null,null,null,null,null,"Yes"]
[null,null,null,null,null,null,null,null,null,null,null,null,null,null,null,null,null,null,null,null,null,null,null,"No"]
[]
[null,null,null,null,null,null,null,null,null,null,null,null,null,null,null,null,null,null,null,null,null,null,"Type of Entities Range:","Parent Municipality"]
[null,null,null,null,null,null,null,null,null,null,null,null,null,null,null,null,null,null,null,null,null,null,null,"Consolidated Information"]
[]
[null,null,null,null,null,null,null,null,null,null,null,null,null,null,null,null,null,null,null,null,null,null,"Date linked",7]
[null,null,null,null,null,null,null,null,null,null,null,null,null,null,null,null,null,null,null,null,null,null,"Date",{"$f":"VLOOKUP(X10,W39:X55,2)","v":"M07 January"},"2013-08-01"]
[]
[]
[]
[]
[]
[]
[]
[null,null,null,null,null,null,null,null,null,null,null,null,null,null,null,null,null,null,null,null,null,null,"MTREF Range:",2008]
[null,null,null,null,null,null,null,null,null,null,null,null,null,null,null,null,null,null,null,null,null,null,null,2009]
[null,null,null,null,null,null,null,null,null,null,null,null,null,null,null,null,null,null,null,null,null,null,null,2010]
[null,null,null,null,null,null,null,null,null,null,null,null,null,null,null,null,null,null,null,null,null,null,null,2011]
[null,null,null,null,null,null,null,null,null,null,null,null,null,null,null,null,null,null,null,null,null,null,null,2012]
[null,null,null,null,null,null,null,null,null,null,null,null,null,null,null,null,null,null,null,null,null,null,null,2013]
[null,null,null,null,null,null,null,null,null,null,null,null,null,null,null,null,null,null,null,null,null,null,null,2014]
[null,null,null,null,null,null,null,null,null,null,null,null,null,null,null,null,null,null,null,null,null,null,null,2015]
[null,null,null,null,null,null,null,null,null,null,null,null,null,null,null,null,null,null,null,null,null,null,null,2016]
[null,null,null,null,null,null,null,null,null,null,null,null,null,null,null,null,null,null,null,null,null,null,null,2017]
[null,null,null,null,null,null,null,null,null,null,null,null,null,null,null,null,null,null,null,null,null,null,null,2018]
[null,null,null,null,null,null,null,null,null,null,null,null,null,null,null,null,null,null,null,null,null,null,null,2019]
[null,null,null,null,null,null,null,null,null,null,null,null,null,null,null,null,null,null,null,null,null,null,null,2020]
[null,null,null,null,null,null,null,null,null,null,null,null,null,null,null,null,null,null,null,null,null,null,null,2021]
[null,null,null,null,null,null,null,null,null,null,null,null,null,null,null,null,null,null,null,null,null,null,null,2022]
[null,null,null,null,null,null,null,null,null,null,null,null,null,null,null,null,null,null,null,null,null,null,"MTREF Linked:"]
[null,null,null,null,null,null,null,null,null,null,null,null,null,null,null,null,null,null,null,null,null,null,"MTREF:",13]
[null,null,null,null,null,null,null,null,null,null,null,null,null,null,null,null,null,null,null,null,null,null,null,{"$f":"INDEX(X19:X33,X35,1)","v":2020}]
[null,null,null,null,null,null,null,null,null,null,null,null,null,null,null,null,null,null,null,null,null,null,"Fin Year:"]
[null,null,null,null,null,null,null,null,null,null,null,null,null,null,null,null,null,null,null,null,null,null,null,{"$f":"MTREF&\"/\"&RIGHT(MTREF,2)+1","v":"2020/21"}]
[null,null,null,null,null,null,null,null,null,null,null,null,null,null,null,null,null,null,null,null,null,"Date/type of report",1,"M01 July"]
[null,null,null,null,null,null,null,null,null,null,null,null,null,null,null,null,null,null,null,null,null,null,2,"M02 August"]
[null,null,null,null,null,null,null,null,null,null,null,null,null,null,null,null,null,null,null,null,null,null,3,"M03 September"]
[null,null,null,null,null,null,null,null,null,null,null,null,null,null,null,null,null,null,null,null,null,null,4,"M04 October"]
[null,null,null,null,null,null,null,null,null,null,null,null,null,null,null,null,null,null,null,null,null,null,5,"M05 November"]
[null,null,null,null,null,null,null,null,null,null,null,null,null,null,null,null,null,null,null,null,null,null,6,"M06 December"]
[null,null,null,null,null,null,null,null,null,null,null,null,null,null,null,null,null,null,null,null,null,null,7,"M07 January"]
[null,null,null,null,null,null,null,null,null,null,null,null,null,null,null,null,null,null,null,null,null,null,8,"M08 February"]
[null,null,null,null,null,null,null,null,null,null,null,null,null,null,null,null,null,null,null,null,null,null,9,"M09 March"]
[null,null,null,null,null,null,null,null,null,null,null,null,null,null,null,null,null,null,null,null,null,null,10,"M10 April"]
[null,null,null,null,null,null,null,null,null,null,null,null,null,null,null,null,null,null,null,null,null,null,11,"M11 May"]
[null,null,null,null,null,null,null,null,null,null,null,null,null,null,null,null,null,null,null,null,null,null,12,"M12 June"]
[null,null,null,null,null,null,null,null,null,null,null,null,null,null,null,null,null,null,null,null,null,null,13,"Q1 First Quarter"]
[null,null,null,null,null,null,null,null,null,null,null,null,null,null,null,null,null,null,null,null,null,null,14,"Q2 Second Quarter"]
[null,null,null,null,null,null,null,null,null,null,null,null,null,null,null,null,null,null,null,null,null,null,15,"Q3 Third Quarter"]
[null,null,null,null,null,null,null,null,null,null,null,null,null,null,null,null,null,null,null,null,null,null,16,"Q4 Fourth Quarter"]
[null,null,null,null,null,null,null,null,null,null,null,null,null,null,null,null,null,null,null,null,null,null,17,"Mid-Year Assessment"]

{"sheet":"Template names","index":2,"n_rows":107,"n_cols":6,"rows_kept":107,"cut":false,"hidden":true,"merged":[[0,0,0,3],[75,0,75,1],[71,0,71,3]]}
["Common sheet headings"]
["Head1",{"$f":"HLOOKUP(MTREF,Headings,2)","v":"2019/20"},"Prior year -1"]
["Head2",{"$f":"HLOOKUP(MTREF,Headings,5)","v":"Budget Year 2020/21"},"Year of approved budget"]
["Head2A",{"$f":"HLOOKUP(MTREF,Headings,4)","v":"2020/21"},"Approved budget year"]
["Head3",{"$f":"HLOOKUP(MTREF,Headings,3)","v":"2020/21 Medium Term Revenue & Expenditure Framework"},"MTREF header name"]
["Head5","Audited Outcome"]
["Head5A","Outcome"]
["Head5B","Pre-audit outcome"]
["Head6","Original Budget"]
["Head7","Adjusted Budget"]
["Head8","Full Year Forecast"]
["Head9",{"$f":"HLOOKUP(MTREF,Headings,5)","v":"Budget Year 2020/21"},"1st year of MTREF","Year1"]
["Head10",{"$f":"HLOOKUP(MTREF,Headings,6)","v":"Budget Year +1 2021/22"},"2nd year of MTREF","Year2"]
["Head11",{"$f":"HLOOKUP(MTREF,Headings,7)","v":"Budget Year +2 2022/23"},"3rd year of MTREF","Year3"]
["Head12","Forecast 2010/11",null,"Year4"]
["Head13","Forecast 2011/12",null,"Year5"]
["Head14","Forecast 2012/13",null,"Year6"]
["Head15","Forecast 2013/14",null,"Year7"]
["Head16","Forecast 2014/15",null,"Year8"]
["Head17","Forecast 2015/16",null,"Year9"]
["Head18","Forecast 2016/17",null,"Year10"]
["Head19","Forecast 2017/18",null,"Year11"]
["Head20","Forecast 2018/19",null,"Year12"]
["Head21","Forecast 2019/20",null,"Year13"]
["Head22","Forecast 2020/21",null,"Year14"]
["Head23","Forecast 2021/22",null,"Year15"]
["Head24","Description",null,"Desc"]
["Head25","Schedule of funding diligence",null,"fdil"]
["Head26","Vote Description",null,"VDesc"]
["Head27","Ref"]
["Head27a","References"]
["Head28","Surplus/ (Deficit) for the year",null,"Result"]
["Head29","Annual target 2007/08"]
["Head30","Revised target 2007/08"]
["Head31","Quarter ended 30 September"]
["Head32","Quarter ended 31 December"]
["Head33","Quarter ended 31 March"]
["Head34","Quarter ended 30 June"]
["Head35","Variance explanation"]
["Head36","YTD  Actual 31 Dec"]
["Head37","YTD  Budget 31 Dec"]
["Head38","Monthly actual"]
["Head39","YearTD actual"]
["Head40","YearTD budget"]
["Head41","YTD variance"]
["Head42","Surplus/ (Deficit) for the yr/period"]
["Head43",{"$f":"Head3&\" Summary\"","v":"2020/21 Medium Term Revenue & Expenditure Framework Summary"}]
["Head44","1996 Census"]
["Head45","2001 Census"]
["Head46"," - Adjustments Budget - Month YYYY"]
["Head47","Previous target year to complete"]
["Head48","Present value"]
["Head49","Virement"]
["Head50","Other Adjusts."]
["Head51","Accum. Funds"]
["Head52","Multi-year capital"]
["Head53","Unfore. Unavoid."]
["Head54","Prior Adjusted"]
["Head55","Nat. or Prov. Govt"]
["Head56","Total Adjusts."]
["Head57",{"$f":"date","v":"M07 January"}]
["Head58","Parent muni."]
["Head59","Downward adjusts"]
["Head60","Month","Report header part name",{"$f":"MONTH(date)","v":{"$error":"#VALUE!"}}]
["SFPerf1","Budgeted Financial Performance"]
["SFPerf2","Forecast Financial Performance"]
["SFPos1","Budgeted Financial Position"]
["SFPos2","Forecast Financial Position"]
["Cash1","Budget Cash Flow"]
["Cash2","Forecast Cash Flow"]
["RandM","Expenditure includes repairs & maintenance of R'000"]
["Standard nomenclature"]
["Muni",{"$f":"'Lookup and lists'!B27","v":"NW375 Moses Kotane"}]
["Municipal Entities",2,"Type of report:",1]
[{"$f":"IF((MuniEntities=1)*(MuniType=2),\"YES\",\"NO\")","v":"NO"},"Does this municipality have entities (consolidated budget and entity budgets required)? YES/NO"]
["s71 (Monthly Mayor report) schedules and charts"]
["S71sum",{"$f":"IF(Consolques=\"YES\",E77,F77)","v":"Table C1 Monthly Budget Statement Summary"},null,"Table C1 ",{"$f":"D77&\"Consolidated Monthly Budget Statement Summary\"","v":"Table C1 Consolidated Monthly Budget Statement Summary"},{"$f":"D77&\"Monthly Budget Statement Summary\"","v":"Table C1 Monthly Budget Statement Summary"}]
["S71C","Table C3 Monthly Budget Statement - Financial Performance (revenue and expenditure by municipal vote)",null,"Table C3 ",{"$f":"D78&\"Consolidated Monthly Budget Statement - Financial Performance (revenue and expenditure by municipal vote) \"","v":"Table C3 Consolidated Monthly Budget Statement - Financial Performance (revenue and expenditure by municipal vote) "},{"$f":"D78&\"Monthly Budget Statement - Financial Performance (revenue and expenditure by municipal vote)\"","v":"Table C3 Monthly Budget Statement - Financial Performance (revenue and expenditure by municipal vote)"}]
["S71A",{"$f":"IF(Consolques=\"YES\",E79,F79)","v":"Table C2 Monthly Budget Statement - Financial Performance (functional classification)"},null,"Table C2 ",{"$f":"D79&\"Consolidated Monthly Budget Statement - Financial Performance (functional classification) \"","v":"Table C2 Consolidated Monthly Budget Statement - Financial Performance (functional classification) "},{"$f":"D79&\"Monthly Budget Statement - Financial Performance (functional classification)\"","v":"Table C2 Monthly Budget Statement - Financial Performance (functional classification)"}]
["S71B",{"$f":"IF(Consolques=\"YES\",E80,F80)","v":"Table C4 Monthly Budget Statement - Financial Performance (revenue and expenditure)"},null,"Table C4 ",{"$f":"D80&\"Consolidated Monthly Budget Statement - Financial Performance (revenue and expenditure) \"","v":"Table C4 Consolidated Monthly Budget Statement - Financial Performance (revenue and expenditure) "},{"$f":"D80&\"Monthly Budget Statement - Financial Performance (revenue and expenditure)\"","v":"Table C4 Monthly Budget Statement - Financial Performance (revenue and expenditure)"}]
["S71D",{"$f":"IF(Consolques=\"YES\",E81,F81)","v":"Table C5 Monthly Budget Statement - Capital Expenditure (municipal vote, functional classification and funding)"},null,"Table C5 ",{"$f":"D81&\"Consolidated Monthly Budget Statement - Capital Expenditure (municipal vote, functional classification and funding \"","v":"Table C5 Consolidated Monthly Budget Statement - Capital Expenditure (municipal vote, functional classification and funding "},{"$f":"D81&\"Monthly Budget Statement - Capital Expenditure (municipal vote, functional classification and funding)\"","v":"Table C5 Monthly Budget Statement - Capital Expenditure (municipal vote, functional classification and funding)"}]
["S71E","Table C6 Monthly Budget Statement - Financial Position",null,"Table C6 ",{"$f":"D82&\"Consolidated Monthly Budget Statement - Financial Position \"","v":"Table C6 Consolidated Monthly Budget Statement - Financial Position "},{"$f":"D82&\"Monthly Budget Statement - Financial Position\"","v":"Table C6 Monthly Budget Statement - Financial Position"}]
["S71F","Table C7 Monthly Budget Statement - Cash Flow ",null,"Table C7 ",{"$f":"D83&\"Consolidated Monthly Budget Statement - Cash Flow \"","v":"Table C7 Consolidated Monthly Budget Statement - Cash Flow "},{"$f":"D83&\"Monthly Budget Statement - Cash Flow \"","v":"Table C7 Monthly Budget Statement - Cash Flow "}]
["S71G",{"$f":"D84&\"Material variance explanations \"","v":"Supporting Table SC1 Material variance explanations "},null,"Supporting Table SC1 "]
["S71H",{"$f":"D85&\"Monthly Budget Statement - performance indicators  \"","v":"Supporting Table SC2 Monthly Budget Statement - performance indicators  "},null,"Supporting Table SC2 "]
["S71I",{"$f":"D86&\"Monthly Budget Statement - aged debtors\"","v":"Supporting Table SC3 Monthly Budget Statement - aged debtors"},null,"Supporting Table SC3 "]
["S71J",{"$f":"D87&\"Monthly Budget Statement - aged creditors \"","v":"Supporting Table SC4 Monthly Budget Statement - aged creditors "},null,"Supporting Table SC4 "]
["S71K",{"$f":"D88&\"Monthly Budget Statement - investment portfolio \"","v":"Supporting Table SC5 Monthly Budget Statement - investment portfolio "},null,"Supporting Table SC5 "]
["S71L",{"$f":"D89&\"Monthly Budget Statement - transfers and grant receipts \"","v":"Supporting Table SC6 Monthly Budget Statement - transfers and grant receipts "},null,"Supporting Table SC6 "]
["S71M",{"$f":"D90&\" Monthly Budget Statement - transfers and grant expenditure \"","v":"Supporting Table SC7(1) Monthly Budget Statement - transfers and grant expenditure "},null,"Supporting Table SC7(1)"]
["S71N",{"$f":"D91&\"Monthly Budget Statement - councillor and staff benefits \"","v":"Supporting Table SC8 Monthly Budget Statement - councillor and staff benefits "},null,"Supporting Table SC8 "]
["S71O",{"$f":"D92&\"Monthly Budget Statement - actuals and revised targets for cash receipts\"","v":"Supporting Table SC9 Monthly Budget Statement - actuals and revised targets for cash receipts"},null,"Supporting Table SC9 "]
["S71P",{"$f":"IF(Consolques=\"YES\",E93,F93)","v":"NOT REQUIRED - municipality does not have entities or this is the parent municipality's budget"},null,"Supporting Table SC10 ",{"$f":"D93&\"Monthly Budget Statement  - Parent Municipality Financial Performance (revenue and expenditure) \"","v":"Supporting Table SC10 Monthly Budget Statement  - Parent Municipality Financial Performance (revenue and expenditure) "},"NOT REQUIRED - municipality does not have entities or this is the parent municipality's budget"]
["S71Q","NOT REQUIRED - municipality does not have entities or this is the parent municipality's budget",null,"Supporting Table SC11 ",{"$f":"D94&\"Monthly Budget Statement - summary of municipal entities\"","v":"Supporting Table SC11 Monthly Budget Statement - summary of municipal entities"},"NOT REQUIRED - municipality does not have entities or this is the parent municipality's budget"]
["S71R","Supporting Table SC12 Monthly Budget Statement - capital expenditure trend",null,"Supporting Table SC12 ",{"$f":"D95&\"Consolidated Monthly Budget Statement - capital expenditure trend \"","v":"Supporting Table SC12 Consolidated Monthly Budget Statement - capital expenditure trend "},{"$f":"D95&\"Monthly Budget Statement - capital expenditure trend\"","v":"Supporting Table SC12 Monthly Budget Statement - capital expenditure trend"}]
["S71Sa","Supporting Table SC13a Monthly Budget Statement - capital expenditure on new assets by asset class",null,"Supporting Table SC13a ",{"$f":"D96&\"Consolidated Monthly Budget Statement - capital expenditure on new assets by asset class\"","v":"Supporting Table SC13a Consolidated Monthly Budget Statement - capital expenditure on new assets by asset class"},{"$f":"D96&\"Monthly Budget Statement - capital expenditure on new assets by asset class\"","v":"Supporting Table SC13a Monthly Budget Statement - capital expenditure on new assets by asset class"}]
["S71Sb","Supporting Table SC13b Monthly Budget Statement - capital expenditure on renewal of existing assets by asset class",null,"Supporting Table SC13b ",{"$f":"D97&\"Consolidated Monthly Budget Statement - capital expenditure on renewal of existing assets by asset class\"","v":"Supporting Table SC13b Consolidated Monthly Budget Statement - capital expenditure on renewal of existing assets by asset class"},{"$f":"D97&\"Monthly Budget Statement - capital expenditure on renewal of existing assets by asset class\"","v":"Supporting Table SC13b Monthly Budget Statement - capital expenditure on renewal of existing assets by asset class"}]
["S71Sc","Supporting Table SC13c Monthly Budget Statement - expenditure on repairs and maintenance by asset class",null,"Supporting Table SC13c ",{"$f":"D98&\"Consolidated Monthly Budget Statement - expenditure on repairs and maintenance by asset class\"","v":"Supporting Table SC13c Consolidated Monthly Budget Statement - expenditure on repairs and maintenance by asset class"},{"$f":"D98&\"Monthly Budget Statement - expenditure on repairs and maintenance by asset class\"","v":"Supporting Table SC13c Monthly Budget Statement - expenditure on repairs and maintenance by asset class"}]
["S71Sd","Supporting Table SC13d Monthly Budget Statement - depreciation by asset class",null,"Supporting Table SC13d ",{"$f":"D99&\"Consolidated Monthly Budget Statement - depreciation by asset class\"","v":"Supporting Table SC13d Consolidated Monthly Budget Statement - depreciation by asset class"},{"$f":"D99&\"Monthly Budget Statement - depreciation by asset class\"","v":"Supporting Table SC13d Monthly Budget Statement - depreciation by asset class"}]
["S71Se",{"$f":"IF(Consolques=\"YES\",E100,F100)","v":"Supporting Table SC13e Monthly Budget Statement - capital expenditure on upgrading of existing assets by asset class"},null,"Supporting Table SC13e ",{"$f":"D100&\"Consolidated Monthly Budget Statement - capital expenditure on upgrading of existing assets by asset class\"","v":"Supporting Table SC13e Consolidated Monthly Budget Statement - capital expenditure on upgrading of existing assets by asset class"},{"$f":"D100&\"Monthly Budget Statement - capital expenditure on upgrading of existing assets by asset class\"","v":"Supporting Table SC13e Monthly Budget Statement - capital expenditure on upgrading of existing assets by asset class"}]
[null,"s71 charts listing"]
[null,{"$f":"D102&Head2A&\" Capital Expenditure Monthly Trend: actual v target\"","v":"Chart C1 2020/21 Capital Expenditure Monthly Trend: actual v target"},null,"Chart C1 "]
[null,{"$f":"D103&Head2A&\" Capital Expenditure: YTD actual v YTD target\"","v":"Chart C2 2020/21 Capital Expenditure: YTD actual v YTD target"},null,"Chart C2 "]
[null,{"$f":"D104&\"Aged Consumer Debtors Analysis\"","v":"Chart C3 Aged Consumer Debtors Analysis"},null,"Chart C3 "]
[null,{"$f":"D105&\"Consumer Debtors (total by Debtor Customer Category)\"","v":"Chart C4 Consumer Debtors (total by Debtor Customer Category)"},null,"Chart C4 "]
[null,{"$f":"D106&\"Aged Creditors Analysis\"","v":"Chart C5 Aged Creditors Analysis"},null,"Chart C5 "]
["S71T",{"$f":"D107&\" Monthly Budget Statement - Expenditure against approved rollovers\"","v":"Supporting Table SC7(2) Monthly Budget Statement - Expenditure against approved rollovers"},null,"Supporting Table SC7(2)"]

{"sheet":"Lookup and lists","index":3,"n_rows":307,"n_cols":22,"rows_kept":307,"cut":false,"hidden":true,"merged":[]}
["Description",2007,2008,2009,2010,2011,2012,2013,2014,2015,2016,2017,2018,2019,2020,null,"Grants:","National - opex","Provincial - opex","National - capex","Provincial - capex","YESNO"]
[{"$f":"'Template names'!C2","v":"Prior year -1"},"2006/07","2007/08","2008/09",{"$f":"E1-1&\"/\"&RIGHT(E1,2)-0","v":"2009/10"},{"$f":"F1-1&\"/\"&RIGHT(F1,2)-0","v":"2010/11"},"2011/12","2012/13","2013/14","2014/15","2015/16","2016/17","2017/18","2018/19","2019/20",null,null,"Local Government Equitable Share","Health subsidy","Municipal Infrastructure Grant (MIG)","Agriculture","Yes"]
[{"$f":"'Template names'!C5","v":"MTREF header name"},"2007/08 Medium Term Revenue & Expenditure Framework","2008/09 Medium Term Revenue & Expenditure Framework","2009/10 Medium Term Revenue & Expenditure Framework",{"$f":"E1&\"/\"&RIGHT(E1,2)+1&\" Medium Term Revenue & Expenditure Framework\"","v":"2010/11 Medium Term Revenue & Expenditure Framework"},{"$f":"F1&\"/\"&RIGHT(F1,2)+1&\" Medium Term Revenue & Expenditure Framework\"","v":"2011/12 Medium Term Revenue & Expenditure Framework"},"2012/13 Medium Term Revenue & Expenditure Framework","2013/14 Medium Term Revenue & Expenditure Framework","2014/15 Medium Term Revenue & Expenditure Framework","2015/16 Medium Term Revenue & Expenditure Framework","2016/17 Medium Term Revenue & Expenditure Framework","2017/18 Medium Term Revenue & Expenditure Framework","2018/19 Medium Term Revenue & Expenditure Framework","2019/20 Medium Term Revenue & Expenditure Framework","2020/21 Medium Term Revenue & Expenditure Framework",null,null,"RSC Levy Replacement ","Ambulance subsidy","Public Transport and Systems","Education","No"]
[{"$f":"'Template names'!C4","v":"Approved budget year"},"2007/08","2008/09","2009/10",{"$f":"E1&\"/\"&RIGHT(E1,2)+1","v":"2010/11"},{"$f":"F1&\"/\"&RIGHT(F1,2)+1","v":"2011/12"},"2012/13","2013/14","2014/15","2015/16","2016/17","2017/18","2018/19","2019/20","2020/21",null,null,"Finance Management ","Housing","Rural Transport Services and Infrastructure","Health"]
[{"$f":"'Template names'!C12","v":"1st year of MTREF"},"Budget Year 2007/08","Budget Year 2008/09","Budget Year 2009/10",{"$f":"\"Budget Year \"&E1&\"/\"&RIGHT(E1,2)+1","v":"Budget Year 2010/11"},{"$f":"\"Budget Year \"&F1&\"/\"&RIGHT(F1,2)+1","v":"Budget Year 2011/12"},"Budget Year 2012/13","Budget Year 2013/14","Budget Year 2014/15","Budget Year 2015/16","Budget Year 2016/17","Budget Year 2017/18","Budget Year 2018/19","Budget Year 2019/20","Budget Year 2020/21",null,null,"Municipal Systems Improvement","Sport and Recreation","Regional Bulk Infrastructure","Housing and Local Government "]
[{"$f":"'Template names'!C13","v":"2nd year of MTREF"},"Budget Year +1 2008/09","Budget Year +1 2009/10","Budget Year +1 2010/11",{"$f":"\"Budget Year +1 \"&E1+1&\"/\"&RIGHT(E1,2)+2","v":"Budget Year +1 2011/12"},{"$f":"\"Budget Year +1 \"&F1+1&\"/\"&RIGHT(F1,2)+2","v":"Budget Year +1 2012/13"},"Budget Year +1 2013/14","Budget Year +1 2014/15","Budget Year +1 2015/16","Budget Year +1 2016/17","Budget Year +1 2017/18","Budget Year +1 2018/19","Budget Year +1 2019/20","Budget Year +1 2020/21","Budget Year +1 2021/22",null,null,"Water Services Operating Subsidy ",null,"Rural Households Infrastructure ","Other Departments"]
[{"$f":"'Template names'!C14","v":"3rd year of MTREF"},"Budget Year +2 2009/10","Budget Year +2 2010/11","Budget Year +2 2011/12",{"$f":"\"Budget Year +2 \"&E1+2&\"/\"&RIGHT(E1,2)+3","v":"Budget Year +2 2012/13"},{"$f":"\"Budget Year +2 \"&F1+2&\"/\"&RIGHT(F1,2)+3","v":"Budget Year +2 2013/14"},"Budget Year +2 2014/15","Budget Year +2 2015/16","Budget Year +2 2016/17","Budget Year +2 2017/18","Budget Year +2 2018/19","Budget Year +2 2019/20","Budget Year +2 2020/21","Budget Year +2 2021/22","Budget Year +2 2022/23",null,null,"Energy Efficiency  and Demand Management",null,"Neighbourhood Development Partnership","Public Works, Roads, Transport "]
["NOTE: This sheet should not be directly amended - select headings from sheet 'S'",null,null,null,null,null,null,null,null,null,null,null,null,null,null,null,null,"Integrated National Electrification Programme",null,"2010 FIFA World Cup Stadiums Development","Sport and Recreation"]
[null,null,null,null,null,null,null,null,null,null,null,null,null,null,null,null,null,"Municipal Drought Relief "]
[null,null,null,null,null,null,null,null,null,null,null,null,null,null,null,null,null,"2010 FIFA World Cup Operating"]
[null,null,null,null,null,null,null,null,null,null,null,null,null,null,null,null,null,"Electricity Demand Side Management"]
[null,null,null,null,null,null,null,null,null,null,null,null,null,null,null,null,null,"EPWP Incentive"]
[]
[]
[]
[]
[]
[]
[]
[]
[]
[]
[]
[]
[]
["Name link",211]
["Name of Muni",{"$f":"INDEX(B28:B311,B26,1)","v":"NW375 Moses Kotane"}]
[null,"Choose name from list","Set name on 'Instructions' sheet"]
[null,"BUF Buffalo City","EC EASTERN CAPE"]
[null,"NMA Nelson Mandela Bay","EC EASTERN CAPE"]
[null,"EC101 Dr Beyers Naude","EC EASTERN CAPE"]
[null,"EC102 Blue Crane Route","EC EASTERN CAPE"]
[null,"EC104 Makana","EC EASTERN CAPE"]
[null,"EC105 Ndlambe","EC EASTERN CAPE"]
[null,"EC106 Sundays River Valley","EC EASTERN CAPE"]
[null,"EC108 Kouga","EC EASTERN CAPE"]
[null,"EC109 Kou-Kamma","EC EASTERN CAPE"]
[null,"DC10 Sarah Baartman","EC EASTERN CAPE"]
[null,"EC121 Mbhashe","EC EASTERN CAPE"]
[null,"EC122 Mnquma","EC EASTERN CAPE"]
[null,"EC123 Great Kei","EC EASTERN CAPE"]
[null,"EC124 Amahlathi","EC EASTERN CAPE"]
[null,"EC126 Ngqushwa","EC EASTERN CAPE"]
[null,"EC129 Raymond Mhlaba","EC EASTERN CAPE"]
[null,"DC12 Amathole","EC EASTERN CAPE"]
[null,"EC131 Inxuba Yethemba","EC EASTERN CAPE"]
[null,"EC135 Intsika Yethu","EC EASTERN CAPE"]
[null,"EC136 Emalahleni (Ec)","EC EASTERN CAPE"]
[null,"EC137 Engcobo","EC EASTERN CAPE"]
[null,"EC138 Sakhisizwe","EC EASTERN CAPE"]
[null,"EC139 Enoch Mgijima","EC EASTERN CAPE"]
[null,"DC13 Chris Hani","EC EASTERN CAPE"]
[null,"EC141 Elundini","EC EASTERN CAPE"]
[null,"EC142 Senqu","EC EASTERN CAPE"]
[null,"EC145 Walter Sisulu","EC EASTERN CAPE"]
[null,"DC14 Joe Gqabi","EC EASTERN CAPE"]
[null,"EC153 Ngquza Hills","EC EASTERN CAPE"]
[null,"EC154 Port St Johns","EC EASTERN CAPE"]
[null,"EC155 Nyandeni","EC EASTERN CAPE"]
[null,"EC156 Mhlontlo","EC EASTERN CAPE"]
[null,"EC157 King Sabata Dalindyebo","EC EASTERN CAPE"]
[null,"DC15 O .R. Tambo","EC EASTERN CAPE"]
[null,"EC441 Matatiele","EC EASTERN CAPE"]
[null,"EC442 Umzimvubu","EC EASTERN CAPE"]
[null,"EC443 Mbizana","EC EASTERN CAPE"]
[null,"EC444 Ntabankulu","EC EASTERN CAPE"]
[null,"DC44 Alfred Nzo","EC EASTERN CAPE"]
[null,"MAN Mangaung","FS FREE STATE"]
[null,"FS161 Letsemeng","FS FREE STATE"]
[null,"FS162 Kopanong","FS FREE STATE"]
[null,"FS163 Mohokare","FS FREE STATE"]
[null,"DC16 Xhariep","FS FREE STATE"]
[null,"FS181 Masilonyana","FS FREE STATE"]
[null,"FS182 Tokologo","FS FREE STATE"]
[null,"FS183 Tswelopele","FS FREE STATE"]
[null,"FS184 Matjhabeng","FS FREE STATE"]
[null,"FS185 Nala","FS FREE STATE"]
[null,"DC18 Lejweleputswa","FS FREE STATE"]
[null,"FS191 Setsoto","FS FREE STATE"]
[null,"FS192 Dihlabeng","FS FREE STATE"]
[null,"FS193 Nketoana","FS FREE STATE"]
[null,"FS194 Maluti-a-Phofung","FS FREE STATE"]
[null,"FS195 Phumelela","FS FREE STATE"]
[null,"FS196 Mantsopa","FS FREE STATE"]
[null,"DC19 Thabo Mofutsanyana","FS FREE STATE"]
[null,"FS201 Moqhaka","FS FREE STATE"]
[null,"FS203 Ngwathe","FS FREE STATE"]
[null,"FS204 Metsimaholo","FS FREE STATE"]
[null,"FS205 Mafube","FS FREE STATE"]
[null,"DC20 Fezile Dabi","FS FREE STATE"]
[null,"EKU City of Ekurhuleni","GT GAUTENG"]
[null,"JHB City Of Johannesburg","GT GAUTENG"]
[null,"TSH City Of Tshwane","GT GAUTENG"]
[null,"GT421 Emfuleni","GT GAUTENG"]
[null,"GT422 Midvaal","GT GAUTENG"]
[null,"GT423 Lesedi","GT GAUTENG"]
[null,"DC42 Sedibeng","GT GAUTENG"]
[null,"GT481 Mogale City","GT GAUTENG"]
[null,"GT484 Merafong City","GT GAUTENG"]
[null,"GT485 Rand West City","GT GAUTENG"]
[null,"DC48 West Rand","GT GAUTENG"]
[null,"ETH eThekwini","KZN KWAZULU-NATAL"]
[null,"KZN212 Umdoni","KZN KWAZULU-NATAL"]
[null,"KZN213 Umzumbe","KZN KWAZULU-NATAL"]
[null,"KZN214 uMuziwabantu","KZN KWAZULU-NATAL"]
[null,"KZN216 Ray Nkonyeni","KZN KWAZULU-NATAL"]
[null,"DC21 Ugu","KZN KWAZULU-NATAL"]
[null,"KZN221 uMshwathi","KZN KWAZULU-NATAL"]
[null,"KZN222 uMngeni","KZN KWAZULU-NATAL"]
[null,"KZN223 Mpofana","KZN KWAZULU-NATAL"]
[null,"KZN224 Impendle","KZN KWAZULU-NATAL"]
[null,"KZN225 Msunduzi","KZN KWAZULU-NATAL"]
[null,"KZN226 Mkhambathini","KZN KWAZULU-NATAL"]
[null,"KZN227 Richmond","KZN KWAZULU-NATAL"]
[null,"DC22 uMgungundlovu","KZN KWAZULU-NATAL"]
[null,"KZN235 Okhahlamba","KZN KWAZULU-NATAL"]
[null,"KZN237 Inkosi Langalibalele","KZN KWAZULU-NATAL"]
[null,"KZN238 Alfred Duma","KZN KWAZULU-NATAL"]
[null,"DC23 Uthukela","KZN KWAZULU-NATAL"]
[null,"KZN241 Endumeni","KZN KWAZULU-NATAL"]
[null,"KZN242 Nquthu","KZN KWAZULU-NATAL"]
[null,"KZN244 Msinga","KZN KWAZULU-NATAL"]
[null,"KZN245 Umvoti","KZN KWAZULU-NATAL"]
[null,"DC24 Umzinyathi","KZN KWAZULU-NATAL"]
[null,"KZN252 Newcastle","KZN KWAZULU-NATAL"]
[null,"KZN253 Emadlangeni","KZN KWAZULU-NATAL"]
[null,"KZN254 Dannhauser","KZN KWAZULU-NATAL"]
[null,"DC25 Amajuba","KZN KWAZULU-NATAL"]
[null,"KZN261 eDumbe","KZN KWAZULU-NATAL"]
[null,"KZN262 uPhongolo","KZN KWAZULU-NATAL"]
[null,"KZN263 Abaqulusi","KZN KWAZULU-NATAL"]
[null,"KZN265 Nongoma","KZN KWAZULU-NATAL"]
[null,"KZN266 Ulundi","KZN KWAZULU-NATAL"]
[null,"DC26 Zululand","KZN KWAZULU-NATAL"]
[null,"KZN271 Umhlabuyalingana","KZN KWAZULU-NATAL"]
[null,"KZN272 Jozini","KZN KWAZULU-NATAL"]
[null,"KZN275 Mtubatuba","KZN KWAZULU-NATAL"]
[null,"KZN276 Hlabisa Big Five","KZN KWAZULU-NATAL"]
[null,"DC27 Umkhanyakude","KZN KWAZULU-NATAL"]
[null,"KZN281 Mfolozi","KZN KWAZULU-NATAL"]
[null,"KZN282 uMhlathuze","KZN KWAZULU-NATAL"]
[null,"KZN284 uMlalazi","KZN KWAZULU-NATAL"]
[null,"KZN285 Mthonjaneni","KZN KWAZULU-NATAL"]
[null,"KZN286 Nkandla","KZN KWAZULU-NATAL"]
[null,"DC28 King Cetshwayo","KZN KWAZULU-NATAL"]
[null,"KZN291 Mandeni","KZN KWAZULU-NATAL"]
[null,"KZN292 KwaDukuza","KZN KWAZULU-NATAL"]
[null,"KZN293 Ndwedwe","KZN KWAZULU-NATAL"]
[null,"KZN294 Maphumulo","KZN KWAZULU-NATAL"]
[null,"DC29 iLembe","KZN KWAZULU-NATAL"]
[null,"KZN433 Greater Kokstad","KZN KWAZULU-NATAL"]
[null,"KZN434 Ubuhlebezwe","KZN KWAZULU-NATAL"]
[null,"KZN435 Umzimkhulu","KZN KWAZULU-NATAL"]
[null,"KZN436 Dr Nkosazana Dlamini Zuma","KZN KWAZULU-NATAL"]
[null,"DC43 Harry Gwala","KZN KWAZULU-NATAL"]
[null,"LIM331 Greater Giyani","LIM LIMPOPO"]
[null,"LIM332 Greater Letaba","LIM LIMPOPO"]
[null,"LIM333 Greater Tzaneen","LIM LIMPOPO"]
[null,"LIM334 Ba-Phalaborwa","LIM LIMPOPO"]
[null,"LIM335 Maruleng","LIM LIMPOPO"]
[null,"DC33 Mopani","LIM LIMPOPO"]
[null,"LIM341 Musina","LIM LIMPOPO"]
[null,"LIM343 Thulamela","LIM LIMPOPO"]
[null,"LIM344 Makhado","LIM LIMPOPO"]
[null,"LIM345 Collins Chabane","LIM LIMPOPO"]
[null,"DC34 Vhembe","LIM LIMPOPO"]
[null,"LIM351 Blouberg","LIM LIMPOPO"]
[null,"LIM353 Molemole","LIM LIMPOPO"]
[null,"LIM354 Polokwane","LIM LIMPOPO"]
[null,"LIM355 Lepelle-Nkumpi","LIM LIMPOPO"]
[null,"DC35 Capricorn","LIM LIMPOPO"]
[null,"LIM361 Thabazimbi","LIM LIMPOPO"]
[null,"LIM362 Lephalale","LIM LIMPOPO"]
[null,"LIM366 Bela Bela","LIM LIMPOPO"]
[null,"LIM367 Mogalakwena","LIM LIMPOPO"]
[null,"LIM368 Modimolle-Mookgopong","LIM LIMPOPO"]
[null,"DC36 Waterberg","LIM LIMPOPO"]
[null,"LIM471 Ephraim Mogale","LIM LIMPOPO"]
[null,"LIM472 Elias Motsoaledi","LIM LIMPOPO"]
[null,"LIM473 Makhuduthamaga","LIM LIMPOPO"]
[null,"LIM476 Tubatse Fetakgomo","LIM LIMPOPO"]
[null,"DC47 Sekhukhune","LIM LIMPOPO"]
[null,"MP301 Albert Luthuli","MP MPUMALANGA"]
[null,"MP302 Msukaligwa","MP MPUMALANGA"]
[null,"MP303 Mkhondo","MP MPUMALANGA"]
[null,"MP304 Pixley Ka Seme (MP)","MP MPUMALANGA"]
[null,"MP305 Lekwa","MP MPUMALANGA"]
[null,"MP306 Dipaleseng","MP MPUMALANGA"]
[null,"MP307 Govan Mbeki","MP MPUMALANGA"]
[null,"DC30 Gert Sibande","MP MPUMALANGA"]
[null,"MP311 Victor Khanye","MP MPUMALANGA"]
[null,"MP312 Emalahleni (Mp)","MP MPUMALANGA"]
[null,"MP313 Steve Tshwete","MP MPUMALANGA"]
[null,"MP314 Emakhazeni","MP MPUMALANGA"]
[null,"MP315 Thembisile Hani","MP MPUMALANGA"]
[null,"MP316 Dr J.S. Moroka","MP MPUMALANGA"]
[null,"DC31 Nkangala","MP MPUMALANGA"]
[null,"MP321 Thaba Chweu","MP MPUMALANGA"]
[null,"MP324 Nkomazi","MP MPUMALANGA"]
[null,"MP325 Bushbuckridge","MP MPUMALANGA"]
[null,"MP326 City of Mbombela","MP MPUMALANGA"]
[null,"DC32 Ehlanzeni","MP MPUMALANGA"]
[null,"NC451 Joe Morolong","NC NORTHERN CAPE"]
[null,"NC452 Ga-Segonyana","NC NORTHERN CAPE"]
[null,"NC453 Gamagara","NC NORTHERN CAPE"]
[null,"DC45 John Taolo Gaetsewe","NC NORTHERN CAPE"]
[null,"NC061 Richtersveld","NC NORTHERN CAPE"]
[null,"NC062 Nama Khoi","NC NORTHERN CAPE"]
[null,"NC064 Kamiesberg","NC NORTHERN CAPE"]
[null,"NC065 Hantam","NC NORTHERN CAPE"]
[null,"NC066 Karoo Hoogland","NC NORTHERN CAPE"]
[null,"NC067 Khai-Ma","NC NORTHERN CAPE"]
[null,"DC6 Namakwa","NC NORTHERN CAPE"]
[null,"NC071 Ubuntu","NC NORTHERN CAPE"]
[null,"NC072 Umsobomvu","NC NORTHERN CAPE"]
[null,"NC073 Emthanjeni","NC NORTHERN CAPE"]
[null,"NC074 Kareeberg","NC NORTHERN CAPE"]
[null,"NC075 Renosterberg","NC NORTHERN CAPE"]
[null,"NC076 Thembelihle","NC NORTHERN CAPE"]
[null,"NC077 Siyathemba","NC NORTHERN CAPE"]
[null,"NC078 Siyancuma","NC NORTHERN CAPE"]
[null,"DC7 Pixley Ka Seme (Nc)","NC NORTHERN CAPE"]
[null,"NC082 !Kai! Garib","NC NORTHERN CAPE"]
[null,"NC084 !Kheis","NC NORTHERN CAPE"]
[null,"NC085 Tsantsabane","NC NORTHERN CAPE"]
[null,"NC086 Kgatelopele","NC NORTHERN CAPE"]
[null,"NC087 Dawid Kruiper","NC NORTHERN CAPE"]
[null,"DC8 Z F Mgcawu","NC NORTHERN CAPE"]
[null,"NC091 Sol Plaatje","NC NORTHERN CAPE"]
[null,"NC092 Dikgatlong","NC NORTHERN CAPE"]
[null,"NC093 Magareng","NC NORTHERN CAPE"]
[null,"NC094 Phokwane","NC NORTHERN CAPE"]
[null,"DC9 Frances Baard","NC NORTHERN CAPE"]
[null,"NW371 Moretele","NW NORTH WEST"]
[null,"NW372 Madibeng","NW NORTH WEST"]
[null,"NW373 Rustenburg","NW NORTH WEST"]
[null,"NW374 Kgetlengrivier","NW NORTH WEST"]
[null,"NW375 Moses Kotane","NW NORTH WEST"]
[null,"DC37 Bojanala Platinum","NW NORTH WEST"]
[null,"NW381 Ratlou","NW NORTH WEST"]
[null,"NW382 Tswaing","NW NORTH WEST"]
[null,"NW383 Mafikeng","NW NORTH WEST"]
[null,"NW384 Ditsobotla","NW NORTH WEST"]
[null,"NW385 Ramotshere Moiloa","NW NORTH WEST"]
[null,"DC38 Ngaka Modiri Molema","NW NORTH WEST"]
[null,"NW392 Naledi (Nw)","NW NORTH WEST"]
[null,"NW393 Mamusa","NW NORTH WEST"]
[null,"NW394 Greater Taung","NW NORTH WEST"]
[null,"NW396 Lekwa-Teemane","NW NORTH WEST"]
[null,"NW397 Kagisano-Molopo","NW NORTH WEST"]
[null,"DC39 Dr Ruth Segomotsi Mompati","NW NORTH WEST"]
[null,"NW403 City Of Matlosana","NW NORTH WEST"]
[null,"NW404 Maquassi Hills","NW NORTH WEST"]
[null,"NW405 J B Marks","NW NORTH WEST"]
[null,"DC40 Dr Kenneth Kaunda","NW NORTH WEST"]
[null,"CPT Cape Town","WC WESTERN CAPE"]
[null,"WC011 Matzikama","WC WESTERN CAPE"]
[null,"WC012 Cederberg","WC WESTERN CAPE"]
[null,"WC013 Bergrivier","WC WESTERN CAPE"]
[null,"WC014 Saldanha Bay","WC WESTERN CAPE"]
[null,"WC015 Swartland","WC WESTERN CAPE"]
[null,"DC1 West Coast","WC WESTERN CAPE"]
[null,"WC022 Witzenberg","WC WESTERN CAPE"]
[null,"WC023 Drakenstein","WC WESTERN CAPE"]
[null,"WC024 Stellenbosch","WC WESTERN CAPE"]
[null,"WC025 Breede Valley","WC WESTERN CAPE"]
[null,"WC026 Langeberg","WC WESTERN CAPE"]
[null,"DC2 Cape Winelands DM","WC WESTERN CAPE"]
[null,"WC031 Theewaterskloof","WC WESTERN CAPE"]
[null,"WC032 Overstrand","WC WESTERN CAPE"]
[null,"WC033 Cape Agulhas","WC WESTERN CAPE"]
[null,"WC034 Swellendam","WC WESTERN CAPE"]
[null,"DC3 Overberg","WC WESTERN CAPE"]
[null,"WC041 Kannaland","WC WESTERN CAPE"]
[null,"WC042 Hessequa","WC WESTERN CAPE"]
[null,"WC043 Mossel Bay","WC WESTERN CAPE"]
[null,"WC044 George","WC WESTERN CAPE"]
[null,"WC045 Oudtshoorn","WC WESTERN CAPE"]
[null,"WC047 Bitou","WC WESTERN CAPE"]
[null,"WC048 Knysna","WC WESTERN CAPE"]
[null,"DC4 Garden Route","WC WESTERN CAPE"]
[null,"WC051 Laingsburg","WC WESTERN CAPE"]
[null,"WC052 Prince Albert","WC WESTERN CAPE"]
[null,"WC053 Beaufort West","WC WESTERN CAPE"]
[null,"DC5 Central Karoo","WC WESTERN CAPE"]
[]
[]
[]
[]
[]
[]
[]
[]
[]
[]
[]
[]
[]
[]
[]
[]
[]
[]
[]
[]
[]
[null,null,{"$f":"COUNTA(C29:C306)","v":257}]

{"sheet":"Org structure","index":4,"n_rows":85,"n_cols":5,"rows_kept":85,"cut":false,"hidden":false,"merged":[]}
["Organisational Structure Votes",null,"Organisational Structure Sub-Votes",null,"Display Sub-Votes"]
[{"$f":"B2&\" - \"&C2","v":"Vote 01 - Municipal Council"},"Vote 01","Municipal Council"]
[{"$f":"B8&\" - \"&C8","v":"Vote 02 - Office Of The Accounting Officer"},"01.1","Office Of The Mayor",{"$f":"CONCATENATE(B3, \" - \", C3)","v":"01.1 - Office Of The Mayor"},"01.1 - Office Of The Mayor"]
[{"$f":"B15&\" - \"&C15","v":"Vote 03 - Budget And Treasury Office"},"01.2","Office Of The Speaker",{"$f":"CONCATENATE(B4, \" - \", C4)","v":"01.2 - Office Of The Speaker"},"01.2 - Office Of The Speaker"]
[{"$f":"B23&\" - \"&C23","v":"Vote 04 - Corporate Services"},"01.3","Office Of The Chief Whip",{"$f":"CONCATENATE(B5, \" - \", C5)","v":"01.3 - Office Of The Chief Whip"},"01.3 - Office Of The Chief Whip"]
[{"$f":"B32&\" - \"&C32","v":"Vote 05 - Community Services"},"01.4","Mpac",{"$f":"CONCATENATE(B6, \" - \", C6)","v":"01.4 - Mpac"},"01.4 - Mpac"]
[{"$f":"B47&\" - \"&C47","v":"Vote 06 - Planning & Development"},"01.5","Council General Administration",{"$f":"CONCATENATE(B7, \" - \", C7)","v":"01.5 - Council General Administration"},"01.5 - Council General Administration"]
[{"$f":"B58&\" - \"&C58","v":"Vote 07 - Infrastructure & Technical Services"},"Vote 02","Office Of The Accounting Officer"]
[{"$f":"B78&\" - \"&C78","v":"Vote 08 - "},"02.1","Office Of The Ao Admin",{"$f":"CONCATENATE(B9, \" - \", C9)","v":"02.1 - Office Of The Ao Admin"},"02.1 - Office Of The Ao Admin"]
["Vote 09 - ","02.2","Strategic Planning Monitoring & Evaluat","02.2 - Strategic Planning Monitoring & Evaluat","02.2 - Strategic Planning Monitoring & Evaluat"]
["Vote 10 - ","02.3","Perfomance Management System","02.3 - Perfomance Management System","02.3 - Perfomance Management System"]
["Vote 11 - ","02.4","Internal Audit","02.4 - Internal Audit","02.4 - Internal Audit"]
["Vote 12 - ","02.5","Municipal Planning Idp","02.5 - Municipal Planning Idp","02.5 - Municipal Planning Idp"]
["Vote 13 - ","02.6","Risk","02.6 - Risk","02.6 - Risk"]
["Vote 14 - ","Vote 03","Budget And Treasury Office"]
["Vote 15 - Other","03.1","Chief Financial Officer Admin",{"$f":"CONCATENATE(B16, \" - \", C16)","v":"03.1 - Chief Financial Officer Admin"},"03.1 - Chief Financial Officer Admin"]
[null,"03.2","Budget Expenditure & Reporting","03.2 - Budget Expenditure & Reporting","03.2 - Budget Expenditure & Reporting"]
[null,"03.3","Budget Expenditure & Reporting","03.3 - Budget Expenditure & Reporting","03.3 - Budget Expenditure & Reporting"]
[null,"03.4","Revenue Management","03.4 - Revenue Management","03.4 - Revenue Management"]
[null,"03.5","Supply Chain Management","03.5 - Supply Chain Management","03.5 - Supply Chain Management"]
[null,"03.6","Assets Management","03.6 - Assets Management","03.6 - Assets Management"]
[null,"03.7","Expenditure","03.7 - Expenditure","03.7 - Expenditure"]
[null,"Vote 04","Corporate Services"]
[null,"04.1","Legal Services",{"$f":"CONCATENATE(B24, \" - \", C24)","v":"04.1 - Legal Services"},"04.1 - Legal Services"]
[null,"04.2","Corporate Service Administration","04.2 - Corporate Service Administration","04.2 - Corporate Service Administration"]
[null,"04.3","Human Resources","04.3 - Human Resources","04.3 - Human Resources"]
[null,"04.4","Media & Communication","04.4 - Media & Communication","04.4 - Media & Communication"]
[null,"04.5","Organisational Development","04.5 - Organisational Development","04.5 - Organisational Development"]
[null,"04.6","Labour Relations","04.6 - Labour Relations","04.6 - Labour Relations"]
[null,"04.7","Legal Services","04.7 - Legal Services","04.7 - Legal Services"]
[null,"04.8","Information Technology Services","04.8 - Information Technology Services","04.8 - Information Technology Services"]
[null,"Vote 05","Community Services"]
[null,"05.1","Municipal Buildings",{"$f":"CONCATENATE(B33, \" - \", C33)","v":"05.1 - Municipal Buildings"},"05.1 - Municipal Buildings"]
[null,"05.2","Fleet Management","05.2 - Fleet Management","05.2 - Fleet Management"]
[null,"05.3","Community Services Administration","05.3 - Community Services Administration","05.3 - Community Services Administration"]
[null,"05.4","Cemeteries","05.4 - Cemeteries","05.4 - Cemeteries"]
[null,"05.5","Disaster Management","05.5 - Disaster Management","05.5 - Disaster Management"]
[null,"05.6","Fires Service","05.6 - Fires Service","05.6 - Fires Service"]
[null,"05.7","Libraries","05.7 - Libraries","05.7 - Libraries"]
[null,"05.8","Municipal Buildings","05.8 - Municipal Buildings","05.8 - Municipal Buildings"]
[null,"05.9","Sports Recreation & Social Amenitie","05.9 - Sports Recreation & Social Amenitie","05.9 - Sports Recreation & Social Amenitie"]
[null,"05.10","Waste Management Solid Waste","05.10 - Waste Management Solid Waste","05.10 - Waste Management Solid Waste"]
[null,"05.11","Safety And Security","05.11 - Safety And Security","05.11 - Safety And Security"]
[null,"05.12","Traffic Service","05.12 - Traffic Service","05.12 - Traffic Service"]
[null,"05.13","Traffic Service","05.13 - Traffic Service","05.13 - Traffic Service"]
[null,"05.14","Fleet Management","05.14 - Fleet Management","05.14 - Fleet Management"]
[null,"Vote 06","Planning & Development"]
[null,"06.1","Planning And Development Admin",{"$f":"CONCATENATE(B48, \" - \", C48)","v":"06.1 - Planning And Development Admin"},"06.1 - Planning And Development Admin"]
[null,"06.2","Municipal Planning Idp","06.2 - Municipal Planning Idp","06.2 - Municipal Planning Idp"]
[null,"06.3","Pms","06.3 - Pms","06.3 - Pms"]
[null,"06.4","Town Planning","06.4 - Town Planning","06.4 - Town Planning"]
[null,"06.5","Land Use And Housing Admin","06.5 - Land Use And Housing Admin","06.5 - Land Use And Housing Admin"]
[null,"06.6","Local Economic Development","06.6 - Local Economic Development","06.6 - Local Economic Development"]
[null,"06.7","Led","06.7 - Led","06.7 - Led"]
[null,"06.8","Agriculture & Rural Development","06.8 - Agriculture & Rural Development","06.8 - Agriculture & Rural Development"]
[null,"06.9","Tourism & Business Development","06.9 - Tourism & Business Development","06.9 - Tourism & Business Development"]
[null,"06.10","Arts & Culture","06.10 - Arts & Culture","06.10 - Arts & Culture"]
[null,"Vote 07","Infrastructure & Technical Services"]
[null,"07.1","Infrastructure Admin & Tech Admin",{"$f":"CONCATENATE(B59, \" - \", C59)","v":"07.1 - Infrastructure Admin & Tech Admin"},"07.1 - Infrastructure Admin & Tech Admin"]
[null,"07.2","Fleet Management","07.2 - Fleet Management","07.2 - Fleet Management"]
[null,"07.3","Roads","07.3 - Roads","07.3 - Roads"]
[null,"07.4","Storm Water","07.4 - Storm Water","07.4 - Storm Water"]
[null,"07.5","Street Lighting","07.5 - Street Lighting","07.5 - Street Lighting"]
[null,"07.6","Project Management Unit","07.6 - Project Management Unit","07.6 - Project Management Unit"]
[null,"07.7","Sanitation Treatment Plant: Mogwase","07.7 - Sanitation Treatment Plant: Mogwase","07.7 - Sanitation Treatment Plant: Mogwase"]
[null,"07.8","Sanitation Treatment Plant: Madikwe","07.8 - Sanitation Treatment Plant: Madikwe","07.8 - Sanitation Treatment Plant: Madikwe"]
[null,"07.9","Sanitation Reticulation","07.9 - Sanitation Reticulation","07.9 - Sanitation Reticulation"]
[null,"07.10","Water Administration","07.10 - Water Administration","07.10 - Water Administration"]
[null,"07.11","Water Madikwe: Water Treatment Work","07.11 - Water Madikwe: Water Treatment Work","07.11 - Water Madikwe: Water Treatment Work"]
[null,"07.12","Water: Pella Water Treatment Works","07.12 - Water: Pella Water Treatment Works","07.12 - Water: Pella Water Treatment Works"]
[null,"07.13","Water: Madikwe Retail & Bulk Lines","07.13 - Water: Madikwe Retail & Bulk Lines","07.13 - Water: Madikwe Retail & Bulk Lines"]
[null,"07.14","Water: Madikwe Rural","07.14 - Water: Madikwe Rural","07.14 - Water: Madikwe Rural"]
[null,"07.15","Water: Molatedi","07.15 - Water: Molatedi","07.15 - Water: Molatedi"]
[null,"07.16","Water Eastern: Retail Mankwe","07.16 - Water Eastern: Retail Mankwe","07.16 - Water Eastern: Retail Mankwe"]
[null,"07.17","Water Vaalkopdam: Mankwe","07.17 - Water Vaalkopdam: Mankwe","07.17 - Water Vaalkopdam: Mankwe"]
[null,"07.18","Water Eastern: Retail Mankwe","07.18 - Water Eastern: Retail Mankwe","07.18 - Water Eastern: Retail Mankwe"]
[null,"07.19","Reporting Function Electricity","07.19 - Reporting Function Electricity","07.19 - Reporting Function Electricity"]
[null,"Vote 08"]
[null,"Vote 09"]
[null,"Vote 10"]
[null,"Vote 11"]
[null,"Vote 12"]
[null,"Vote 13"]
[null,"Vote 14"]
[null,"Vote 15","Other"]

{"sheet":"Contacts","index":5,"n_rows":140,"n_cols":4,"rows_kept":140,"cut":false,"hidden":false,"merged":[[132,0,132,1],[132,2,132,3],[108,0,108,1],[108,2,108,3],[116,0,116,1],[116,2,116,3],[124,0,124,1],[124,2,124,3],[84,0,84,1],[84,2,84,3],[92,0,92,1],[92,2,92,3],[100,0,100,1],[100,2,100,3],[7,2,7,3],[10,2,10,3],[12,2,12,3],[13,0,13,1],[29,0,29,1],[29,2,29,3],[58,2,58,3],[67,2,67,3],[76,0,76,1],[76,2,76,3],[30,2,30,3],[39,0,39,1],[39,2,39,3],[48,0,48,1],[48,2,48,3],[57,0,57,1],[57,2,57,3]]}
[{"$f":"muni&\" - \"&\" Contact Information\"","v":"NW375 Moses Kotane -  Contact Information"}]
[]
["A. GENERAL INFORMATION"]
["Municipality",{"$f":"muni","v":"NW375 Moses Kotane"},"Set name on 'Instructions' sheet"]
[]
["Grade",2,"1 Grade in terms of the Remuneration of Public Office Bearers Act."]
[]
["Province",{"$f":"IF(B4>\" \",VLOOKUP(B4,'Lookup and lists'!B28:C311,2, FALSE),\" \")","v":"NW NORTH WEST"}]
[]
["Web Address","www.moseskotane.gov.za"]
[]
["e-mail Address","municipalmanager@moseskotane.gov.za"]
[]
["B. CONTACT INFORMATION"]
["Postal address:"]
["P.O. Box",1011]
["City / Town","Mogwase"]
["Postal Code","0314"]
[]
["Street address"]
["Building","Mogwase Shopping Complex"]
["Street No. & Name","935 Station Road"]
["City / Town","Mogwase"]
["Postal Code","0314"]
[]
["General Contacts"]
["Telephone number","014 555 1300"]
["Fax number","014 555 6368"]
[]
["C. POLITICAL LEADERSHIP"]
["Speaker:",null,"Secretary/PA to the Speaker:"]
["ID Number","7206135791081","ID Number",""]
["Title","Clr","Title","Ms"]
["Name","Sipho Vava ","Name","D MANAME"]
["Telephone number","014 555 1309","Telephone number","014 555 1309"]
["Cell number","0823079727","Cell number","073 973 7862"]
["Fax number","014 555 6368","Fax number","014 555 7635"]
["E-mail address","speakersecretary@moseskotane.gov.za","E-mail address","speakersecretary@moseskotane.gov.za"]
[]
["Mayor/Executive Mayor:",null,"Secretary/PA to the Mayor/Executive Mayor:"]
["ID Number","","ID Number",""]
["Title","Clr","Title","Mrs"]
["Name","A R DIALE","Name","M MORUPI"]
["Telephone number","014 555 1305","Telephone number","014 555 1305"]
["Cell number","082 467 2895","Cell number","079 342 0861"]
["Fax number","014 555 6368","Fax number","014 555 6368"]
["E-mail address","mayorssecretary@moseskotane.gov.za","E-mail address","mayorsecretary@moseskotane.gov.za"]
[]
["Deputy Mayor/Executive Mayor:",null,"Secretary/PA to the Deputy Mayor/Executive Mayor:"]
["ID Number",null,"ID Number"]
["Title",null,"Title"]
["Name",null,"Name"]
["Telephone number",null,"Telephone number"]
["Cell number",null,"Cell number"]
["Fax number",null,"Fax number"]
["E-mail address",null,"E-mail address"]
[]
["D. MANAGEMENT LEADERSHIP"]
["Municipal Manager:",null,"Secretary/PA to the Municipal Manager:"]
["ID Number","","ID Number",""]
["Title","Mr ","Title","Ms"]
["Name","M V LETSOALO","Name","WINNIE MABALANE"]
["Telephone number","014 555 1307","Telephone number","014 555 1307"]
["Cell number","066 300 6349","Cell number","082 543 4845"]
["Fax number","086 654 5962","Fax number","086 654 5962"]
["E-mail address","066 300 6349","E-mail address","municipalmanager@moseskotane.gov.za"]
[]
["Chief Financial Officer",null,"Secretary/PA to the Chief Financial Officer"]
["ID Number","8409265857081","ID Number"]
["Title","Mr","Title"]
["Name","MR Mkhize ","Name"]
["Telephone number","014 555 1332","Telephone number"]
["Cell number","0609782021","Cell number"]
["Fax number","","Fax number"]
["E-mail address","cfo@moseskotane.gov.za","E-mail address"]
[]
["Official responsible for submitting financial information",null,"Official responsible for submitting financial information"]
["ID Number","","ID Number"]
["Title","Ms T Lebusa","Title"]
["Name","T LEBUSA","Name"]
["Telephone number","014 555 1333","Telephone number"]
["Cell number","082 051 2347","Cell number"]
["Fax number","086 232 1786","Fax number"]
["E-mail address","tlebusa@moseskotane.gov.za","E-mail address"]
["Official responsible for submitting financial information",null,"Official responsible for submitting financial information"]
["ID Number",null,"ID Number"]
["Title",null,"Title"]
["Name",null,"Name"]
["Telephone number",null,"Telephone number"]
["Cell number",null,"Cell number"]
["Fax number",null,"Fax number"]
["E-mail address",null,"E-mail address"]
["Official responsible for submitting financial information",null,"Official responsible for submitting financial information"]
["ID Number",null,"ID Number"]
["Title",null,"Title"]
["Name",null,"Name"]
["Telephone number",null,"Telephone number"]
["Cell number",null,"Cell number"]
["Fax number",null,"Fax number"]
["E-mail address",null,"E-mail address"]
["Official responsible for submitting financial information",null,"Official responsible for submitting financial information"]
["ID Number",null,"ID Number"]
["Title",null,"Title"]
["Name",null,"Name"]
["Telephone number",null,"Telephone number"]
["Cell number",null,"Cell number"]
["Fax number",null,"Fax number"]
["E-mail address",null,"E-mail address"]
["Official responsible for submitting financial information",null,"Official responsible for submitting financial information"]
["ID Number",null,"ID Number"]
["Title",null,"Title"]
["Name",null,"Name"]
["Telephone number",null,"Telephone number"]
["Cell number",null,"Cell number"]
["Fax number",null,"Fax number"]
["E-mail address",null,"E-mail address"]
["Official responsible for submitting financial information",null,"Official responsible for submitting financial information"]
["ID Number",null,"ID Number"]
["Title",null,"Title"]
["Name",null,"Name"]
["Telephone number",null,"Telephone number"]
["Cell number",null,"Cell number"]
["Fax number",null,"Fax number"]
["E-mail address",null,"E-mail address"]
["Official responsible for submitting financial information",null,"Official responsible for submitting financial information"]
["ID Number",null,"ID Number"]
["Title",null,"Title"]
["Name",null,"Name"]
["Telephone number",null,"Telephone number"]
["Cell number",null,"Cell number"]
["Fax number",null,"Fax number"]
["E-mail address",null,"E-mail address"]
["Official responsible for submitting financial information"]
["ID Number"]
["Title"]
["Name"]
["Telephone number"]
["Cell number"]
["Fax number"]
["E-mail address"]

{"sheet":"C1-Sum","index":6,"n_rows":52,"n_cols":10,"rows_kept":52,"cut":false,"hidden":false,"merged":[[54,0,54,9],[1,0,2,0],[1,2,1,9]]}
[{"$f":"muni& \" - \"&s71sum& \" - \"&date","v":"NW375 Moses Kotane - Table C1 Monthly Budget Statement Summary - M07 January"}]
[{"$f":"desc","v":"Description"},{"$f":"Head1","v":"2019/20"},{"$f":"Head2","v":"Budget Year 2020/21"}]
[null,{"$f":"Head5","v":"Audited Outcome"},{"$f":"Head6","v":"Original Budget"},{"$f":"Head7","v":"Adjusted Budget"},{"$f":"Head38","v":"Monthly actual"},{"$f":"Head39","v":"YearTD actual"},{"$f":"Head40","v":"YearTD budget"},{"$f":"Head41","v":"YTD variance"},{"$f":"Head41","v":"YTD variance"},{"$f":"Head8","v":"Full Year Forecast"}]
["R thousands",null,null,null,null,null,null,null,"%"]
["Financial Performance"]
["Property rates",{"$f":"SUM('C4-FinPerf RE'!C6:C6)","v":141419581.36000001},{"$f":"SUM('C4-FinPerf RE'!D6:D6)","v":148602075},{"$f":"SUM('C4-FinPerf RE'!E6:E6)","v":148602075},{"$f":"SUM('C4-FinPerf RE'!F6:F6)","v":12099935.619999999},{"$f":"SUM('C4-FinPerf RE'!G6:G6)","v":84208675.900000006},{"$f":"SUM('C4-FinPerf RE'!H6:H6)","v":86684500},{"$f":"F6-G6","v":-2475824.099999994},{"$f":"IF(H6=0,\"\",H6/G6)","v":-2.8561324112153775E-2},{"$f":"SUM('C4-FinPerf RE'!K6:K6)","v":148602075}]
["Service charges",{"$f":"SUM('C4-FinPerf RE'!C7:C10)","v":177042111.14000002},{"$f":"SUM('C4-FinPerf RE'!D7:D10)","v":186492720},{"$f":"SUM('C4-FinPerf RE'!E7:E10)","v":186492720},{"$f":"SUM('C4-FinPerf RE'!F7:F10)","v":19196155.48},{"$f":"SUM('C4-FinPerf RE'!G7:G10)","v":104428086.98},{"$f":"SUM('C4-FinPerf RE'!H7:H10)","v":108787371},{"$f":"F7-G7","v":-4359284.0199999958},{"$f":"IF(H7=0,\"\",H7/G7)","v":-4.007160003894198E-2},{"$f":"SUM('C4-FinPerf RE'!K7:K10)","v":186492720}]
["Investment revenue",{"$f":"'C4-FinPerf RE'!C13","v":5586509.7199999997},{"$f":"'C4-FinPerf RE'!D13","v":5400000},{"$f":"'C4-FinPerf RE'!E13","v":5400000},{"$f":"'C4-FinPerf RE'!F13","v":26429.72},{"$f":"'C4-FinPerf RE'!G13","v":1560022.16},{"$f":"'C4-FinPerf RE'!H13","v":3150000},{"$f":"F8-G8","v":-1589977.84},{"$f":"IF(H8=0,\"\",H8/G8)","v":-0.50475486984126983},{"$f":"'C4-FinPerf RE'!K13","v":5400000}]
["Transfers and subsidies",{"$f":"'C4-FinPerf RE'!C19","v":434445420.41000003},{"$f":"'C4-FinPerf RE'!D19","v":467694767},{"$f":"'C4-FinPerf RE'!E19","v":550339767},{"$f":"'C4-FinPerf RE'!F19","v":0},{"$f":"'C4-FinPerf RE'!G19","v":429726279.18000001},{"$f":"'C4-FinPerf RE'!H19","v":314144427},{"$f":"F9-G9","v":115581852.18000001},{"$f":"IF(H9=0,\"\",H9/G9)","v":0.36792583998314893},{"$f":"'C4-FinPerf RE'!K19","v":550339767}]
["Other own revenue",{"$f":"'C4-FinPerf RE'!C12+'C4-FinPerf RE'!C14+'C4-FinPerf RE'!C15+'C4-FinPerf RE'!C16+'C4-FinPerf RE'!C17+'C4-FinPerf RE'!C18+'C4-FinPerf RE'!C20+'C4-FinPerf RE'!C21","v":72405632.450000003},{"$f":"'C4-FinPerf RE'!D12+'C4-FinPerf RE'!D14+'C4-FinPerf RE'!D15+'C4-FinPerf RE'!D16+'C4-FinPerf RE'!D17+'C4-FinPerf RE'!D18+'C4-FinPerf RE'!D20+'C4-FinPerf RE'!D21","v":67591050},{"$f":"'C4-FinPerf RE'!E12+'C4-FinPerf RE'!E14+'C4-FinPerf RE'!E15+'C4-FinPerf RE'!E16+'C4-FinPerf RE'!E17+'C4-FinPerf RE'!E18+'C4-FinPerf RE'!E20+'C4-FinPerf RE'!E21","v":67591050},{"$f":"'C4-FinPerf RE'!F12+'C4-FinPerf RE'!F14+'C4-FinPerf RE'!F15+'C4-FinPerf RE'!F16+'C4-FinPerf RE'!F17+'C4-FinPerf RE'!F18+'C4-FinPerf RE'!F20+'C4-FinPerf RE'!F21","v":6624491.7400000002},{"$f":"'C4-FinPerf RE'!G12+'C4-FinPerf RE'!G14+'C4-FinPerf RE'!G15+'C4-FinPerf RE'!G16+'C4-FinPerf RE'!G17+'C4-FinPerf RE'!G18+'C4-FinPerf RE'!G20+'C4-FinPerf RE'!G21","v":39261930.760000005},{"$f":"'C4-FinPerf RE'!H12+'C4-FinPerf RE'!H14+'C4-FinPerf RE'!H15+'C4-FinPerf RE'!H16+'C4-FinPerf RE'!H17+'C4-FinPerf RE'!H18+'C4-FinPerf RE'!H20+'C4-FinPerf RE'!H21","v":39428060},{"$f":"F10-G10","v":-166129.23999999464},{"$f":"IF(H10=0,\"\",H10/G10)","v":-4.2134774066995596E-3},{"$f":"'C4-FinPerf RE'!K12+'C4-FinPerf RE'!K14+'C4-FinPerf RE'!K15+'C4-FinPerf RE'!K16+'C4-FinPerf RE'!K17+'C4-FinPerf RE'!K18+'C4-FinPerf RE'!K20+'C4-FinPerf RE'!K21","v":67591050}]
["Total Revenue (excluding capital transfers and contributions)",{"$f":"SUM(B6:B10)","v":830899255.08000016},875780612,958425612,37947012.560000002,659184994.98000002,552194358,{"$f":"F11-G11","v":106990636.98000002},{"$f":"IF(H11=0,\"\",H11/G11)","v":0.19375539686336313},958425612]
["Employee costs",{"$f":"'C4-FinPerf RE'!C25","v":236924858.34999999},{"$f":"'C4-FinPerf RE'!D25","v":270831407},{"$f":"'C4-FinPerf RE'!E25","v":272119407},{"$f":"'C4-FinPerf RE'!F25","v":19015199},{"$f":"'C4-FinPerf RE'!G25","v":139705628.5},{"$f":"'C4-FinPerf RE'!H25","v":158629912},-18924283.5,-0.11929832943486723,{"$f":"'C4-FinPerf RE'!K25","v":272119407}]
["Remuneration of Councillors",{"$f":"'C4-FinPerf RE'!C26","v":24128277.649999999},{"$f":"'C4-FinPerf RE'!D26","v":24819114},{"$f":"'C4-FinPerf RE'!E26","v":24819114},{"$f":"'C4-FinPerf RE'!F26","v":2026094.6},{"$f":"'C4-FinPerf RE'!G26","v":14907625.119999999},{"$f":"'C4-FinPerf RE'!H26","v":14477834},429791.11999999918,2.9686147803600953E-2,{"$f":"'C4-FinPerf RE'!K26","v":24819114}]
["Depreciation & asset impairment",{"$f":"'C4-FinPerf RE'!C28","v":146795994.87},{"$f":"'C4-FinPerf RE'!D28","v":133503316},{"$f":"'C4-FinPerf RE'!E28","v":133503316},{"$f":"'C4-FinPerf RE'!F28","v":77876911},{"$f":"'C4-FinPerf RE'!G28","v":77876911},{"$f":"'C4-FinPerf RE'!H28","v":77877002},-91,-1.168509285963525E-6,{"$f":"'C4-FinPerf RE'!K28","v":133503316}]
["Finance charges",{"$f":"'C4-FinPerf RE'!C29","v":5347470.47},{"$f":"'C4-FinPerf RE'!D29","v":3043808},{"$f":"'C4-FinPerf RE'!E29","v":3043808},{"$f":"'C4-FinPerf RE'!F29","v":6028.98},{"$f":"'C4-FinPerf RE'!G29","v":1586336.46},{"$f":"'C4-FinPerf RE'!H29","v":1775571},-189234.54000000004,-0.10657672376942405,{"$f":"'C4-FinPerf RE'!K29","v":3043808}]
["Materials and bulk purchases",{"$f":"SUM('C4-FinPerf RE'!C30:C31)","v":132620027.34999999},{"$f":"SUM('C4-FinPerf RE'!D30:D31)","v":86827300},{"$f":"SUM('C4-FinPerf RE'!E30:E31)","v":106857300},{"$f":"SUM('C4-FinPerf RE'!F30:F31)","v":9812728.7799999993},{"$f":"SUM('C4-FinPerf RE'!G30:G31)","v":48263593.980000004},{"$f":"SUM('C4-FinPerf RE'!H30:H31)","v":60664305},-12400711.019999996,-0.20441528210040477,{"$f":"SUM('C4-FinPerf RE'!K30:K31)","v":106857300}]
["Transfers and subsidies",{"$f":"'C4-FinPerf RE'!C33","v":0},{"$f":"'C4-FinPerf RE'!D33","v":0},{"$f":"'C4-FinPerf RE'!E33","v":0},{"$f":"'C4-FinPerf RE'!F33","v":0},{"$f":"'C4-FinPerf RE'!G33","v":0},{"$f":"'C4-FinPerf RE'!H33","v":0},0,"",{"$f":"'C4-FinPerf RE'!K33","v":0}]
["Other expenditure",{"$f":"'C4-FinPerf RE'!C36-SUM('C1-Sum'!B12:B17)","v":460338993.88999999},{"$f":"'C4-FinPerf RE'!D36-SUM('C1-Sum'!C12:C17)","v":335952317},{"$f":"'C4-FinPerf RE'!E36-SUM('C1-Sum'!D12:D17)","v":376724802},{"$f":"'C4-FinPerf RE'!F36-SUM('C1-Sum'!E12:E17)","v":121419145.33999999},{"$f":"'C4-FinPerf RE'!G36-SUM('C1-Sum'!F12:F17)","v":232699192.80999994},{"$f":"'C4-FinPerf RE'!H36-SUM('C1-Sum'!G12:G17)","v":216358774.5},16340418.309999943,7.5524638867835434E-2,{"$f":"'C4-FinPerf RE'!K36-SUM('C1-Sum'!J12:J17)","v":376724802}]
["Total Expenditure",{"$f":"SUM(B12:B18)","v":1006155622.58},854977262,917067747,230156107.69999999,515039287.86999995,529783398.5,-14744110.630000055,-2.783045046663548E-2,{"$f":"SUM(J12:J18)","v":917067747}]
["Surplus/(Deficit)",{"$f":"B11-B19","v":-175256367.49999988},20803350,41357865,-192209095.13999999,144145707.11000007,22410959.5,121734747.61000007,5.4319293027145967,{"$f":"J11-J19","v":41357865}]
[{"$f":"'C4-FinPerf RE'!A39","v":"Transfers and subsidies - capital (monetary allocations) (National / Provincial and District)"},{"$f":"'C4-FinPerf RE'!C39","v":68075621.780000001},{"$f":"'C4-FinPerf RE'!D39","v":202495233},{"$f":"'C4-FinPerf RE'!E39","v":202495233},{"$f":"'C4-FinPerf RE'!F39","v":0},{"$f":"'C4-FinPerf RE'!G39","v":0},{"$f":"'C4-FinPerf RE'!H39","v":118122200},-118122200,-1,{"$f":"'C4-FinPerf RE'!K39","v":202495233}]
[{"$f":"'C4-FinPerf RE'!A40&\" & \"&'C4-FinPerf RE'!A41","v":"Transfers and subsidies - capital (monetary allocations) (National / Provincial Departmental Agencies, Households, Non-profit Institutions, Private Enterprises, Public Corporatons, Higher Educational Institutions) & Transfers and subsidies - capital (in-kind - all) "},{"$f":"SUM('C4-FinPerf RE'!C40:C41)","v":96552077.219999999},{"$f":"SUM('C4-FinPerf RE'!D40:D41)","v":0},{"$f":"SUM('C4-FinPerf RE'!E40:E41)","v":0},{"$f":"SUM('C4-FinPerf RE'!F40:F41)","v":0},{"$f":"SUM('C4-FinPerf RE'!G40:G41)","v":0},{"$f":"SUM('C4-FinPerf RE'!H40:H41)","v":0},0,"",{"$f":"SUM('C4-FinPerf RE'!K40:K41)","v":0}]
["Surplus/(Deficit) after capital transfers & contributions",{"$f":"B20+B21+B22","v":-10628668.499999881},223298583,243853098,-192209095.13999999,144145707.11000007,140533159.5,3612547.6100000739,2.570601573929656E-2,{"$f":"J20+J21+J22","v":243853098}]
["Share of surplus/ (deficit) of associate",{"$f":"'C4-FinPerf RE'!C47","v":0},{"$f":"'C4-FinPerf RE'!D47","v":0},{"$f":"'C4-FinPerf RE'!E47","v":0},{"$f":"'C4-FinPerf RE'!F47","v":0},{"$f":"'C4-FinPerf RE'!G47","v":0},{"$f":"'C4-FinPerf RE'!H47","v":0},0,"",{"$f":"'C4-FinPerf RE'!K47","v":0}]
["Surplus/ (Deficit) for the year",{"$f":"B23+B24","v":-10628668.499999881},223298583,243853098,-192209095.13999999,144145707.11000007,140533159.5,3612547.6100000739,2.570601573929656E-2,{"$f":"J23+J24","v":243853098}]
[]
["Capital expenditure & funds sources"]
["Capital expenditure",{"$f":"'C5-Capex'!C40","v":22910640.889999997},{"$f":"'C5-Capex'!D40","v":203495233},{"$f":"'C5-Capex'!E40","v":203495233},{"$f":"'C5-Capex'!F40","v":6904946.1899999995},{"$f":"'C5-Capex'!G40","v":73187957.599999994},{"$f":"'C5-Capex'!H40","v":118705671},{"$f":"F28-G28","v":-45517713.400000006},{"$f":"IF(H28=0,\"\",H28/G28)","v":-0.38345020095964921},{"$f":"'C5-Capex'!K40","v":203495233}]
["Capital transfers recognised",{"$f":"'C5-Capex'!C70","v":22738382.280000001},{"$f":"'C5-Capex'!D70","v":202495233},{"$f":"'C5-Capex'!E70","v":202495233},{"$f":"'C5-Capex'!F70","v":5758720.0099999998},{"$f":"'C5-Capex'!G70","v":70502585.579999998},{"$f":"'C5-Capex'!H70","v":118122333},-47619747.420000002,-0.40313923887703779,{"$f":"'C5-Capex'!K70","v":202495233}]
[]
["Borrowing",{"$f":"'C5-Capex'!C72","v":0},{"$f":"'C5-Capex'!D72","v":0},{"$f":"'C5-Capex'!E72","v":0},{"$f":"'C5-Capex'!F72","v":0},{"$f":"'C5-Capex'!G72","v":0},{"$f":"'C5-Capex'!H72","v":0},0,"",{"$f":"'C5-Capex'!K72","v":0}]
["Internally generated funds",{"$f":"'C5-Capex'!C73","v":172258.61},{"$f":"'C5-Capex'!D73","v":1000000},{"$f":"'C5-Capex'!E73","v":1000000},{"$f":"'C5-Capex'!F73","v":1146226.18},{"$f":"'C5-Capex'!G73","v":2685372.02},{"$f":"'C5-Capex'!H73","v":583338},2102034.02,3.6034580637640614,{"$f":"'C5-Capex'!K73","v":1000000}]
["Total sources of capital funds",{"$f":"+B29+B31+B32","v":22910640.890000001},203495233,203495233,6904946.1899999995,73187957.599999994,118705671,-45517713.400000006,-0.38345020095964921,{"$f":"+J29+J31+J32","v":203495233}]
[]
["Financial position"]
["Total current assets",{"$f":"'C6-FinPos'!C13","v":191810788.34999999},{"$f":"'C6-FinPos'!D13","v":169043591},{"$f":"'C6-FinPos'!E13","v":471860917},null,{"$f":"'C6-FinPos'!F13","v":341029598.84000003},null,null,null,{"$f":"'C6-FinPos'!G13","v":471860917}]
["Total non current assets",{"$f":"'C6-FinPos'!C25","v":3069450546.77},{"$f":"'C6-FinPos'!D25","v":3686970409},{"$f":"'C6-FinPos'!E25","v":3275337330},null,{"$f":"'C6-FinPos'!F25","v":3064761593.3700004},null,null,null,{"$f":"'C6-FinPos'!G25","v":3275337330}]
["Total current liabilities",{"$f":"'C6-FinPos'!C35","v":374230239.86000001},{"$f":"'C6-FinPos'!D35","v":86362000},{"$f":"'C6-FinPos'!E35","v":368430240},null,{"$f":"'C6-FinPos'!F35","v":374802451.83999991},null,null,null,{"$f":"'C6-FinPos'!G35","v":368430240}]
["Total non current liabilities",{"$f":"'C6-FinPos'!C40","v":30725685.369999997},{"$f":"'C6-FinPos'!D40","v":29829314},{"$f":"'C6-FinPos'!E40","v":30725686},null,{"$f":"'C6-FinPos'!F40","v":31075685.369999997},null,null,null,{"$f":"'C6-FinPos'!G40","v":30725686}]
["Community wealth/Equity",{"$f":"'C6-FinPos'!C48","v":2856305409.8900003},{"$f":"'C6-FinPos'!D48","v":3516524103},{"$f":"'C6-FinPos'!E48","v":3088472378},null,{"$f":"'C6-FinPos'!F48","v":2999913055},null,null,null,{"$f":"'C6-FinPos'!G48","v":3088472378}]
[]
["Cash flows"]
["Net cash from (used) operating",{"$f":"'C7-CFlow'!C18","v":0},{"$f":"'C7-CFlow'!D18","v":0},{"$f":"'C7-CFlow'!E18","v":1057406},{"$f":"'C7-CFlow'!F18","v":-40901875.489999995},{"$f":"'C7-CFlow'!G18","v":220713745.77000004},{"$f":"'C7-CFlow'!H18","v":616820.05000001192},{"$f":"G43-F43","v":-220096925.72000003},{"$f":"IF(H43=0,\"\",H43/G43)","v":-356.82518056926938},{"$f":"'C7-CFlow'!K18","v":1057406}]
["Net cash from (used) investing",{"$f":"'C7-CFlow'!C28","v":0},{"$f":"'C7-CFlow'!D28","v":0},{"$f":"'C7-CFlow'!E28","v":0},{"$f":"'C7-CFlow'!F28","v":-6904946.1900000004},{"$f":"'C7-CFlow'!G28","v":-47713765.590000004},{"$f":"'C7-CFlow'!H28","v":0},{"$f":"G44-F44","v":47713765.590000004},{"$f":"IF(H44=0,\"\",H44/G44)","v":{"$error":"#DIV/0!"}},{"$f":"'C7-CFlow'!K28","v":0}]
["Net cash from (used) financing",{"$f":"'C7-CFlow'!C37","v":-6181846.4900000002},{"$f":"'C7-CFlow'!D37","v":0},{"$f":"'C7-CFlow'!E37","v":-2815500},{"$f":"'C7-CFlow'!F37","v":-1722.22},{"$f":"'C7-CFlow'!G37","v":-2650500.81},{"$f":"'C7-CFlow'!H37","v":-1251333.2},{"$f":"G45-F45","v":1399167.61},{"$f":"IF(H45=0,\"\",H45/G45)","v":-1.1181415229772536},{"$f":"'C7-CFlow'!K37","v":-2815500}]
["Cash/cash equivalents at the month/year end",{"$f":"'C7-CFlow'!C41","v":58491414.799999997},{"$f":"'C7-CFlow'!D41","v":19040753},{"$f":"'C7-CFlow'!E41","v":44897761},{"$f":"'C7-CFlow'!F41","v":0},{"$f":"'C7-CFlow'!G41","v":219130130.18000004},{"$f":"'C7-CFlow'!H41","v":-634513.14999998803},{"$f":"G46-F46","v":-219764643.33000001},{"$f":"IF(H46=0,\"\",H46/G46)","v":346.35159780377154},{"$f":"'C7-CFlow'!K41","v":-1758094}]
[]
["Debtors & creditors analysis",{"$f":"'SC3'!C3","v":"0-30 Days"},{"$f":"'SC3'!D3","v":"31-60 Days"},{"$f":"'SC3'!E3","v":"61-90 Days"},{"$f":"'SC3'!F3","v":"91-120 Days"},{"$f":"'SC3'!G3","v":"121-150 Dys"},{"$f":"'SC3'!H3","v":"151-180 Dys"},{"$f":"'SC3'!I3","v":"181 Dys-1 Yr"},{"$f":"'SC3'!J3","v":"Over 1Yr"},"Total"]
[{"$f":"LEFT('SC3'!A4,20)","v":"Debtors Age Analysis"}]
[{"$f":"'SC3'!A14","v":"Total By Income Source"},{"$f":"'SC3'!C14","v":75402115},{"$f":"'SC3'!D14","v":32977160},{"$f":"'SC3'!E14","v":32419706},{"$f":"'SC3'!F14","v":33402540},{"$f":"'SC3'!G14","v":28779214},{"$f":"'SC3'!H14","v":25344132},{"$f":"'SC3'!I14","v":162478680},{"$f":"'SC3'!J14","v":989283789},{"$f":"'SC3'!K14","v":1380087336}]
[{"$f":"LEFT('SC4'!A5,22)","v":"Creditors Age Analysis"}]
["Total Creditors",{"$f":"'SC4'!C15","v":2222350.38},{"$f":"'SC4'!D15","v":61881.5},{"$f":"'SC4'!E15","v":1740603.85},{"$f":"'SC4'!F15","v":4024835.73},{"$f":"'SC4'!G15","v":0},{"$f":"'SC4'!H15","v":0},{"$f":"'SC4'!I15","v":0},{"$f":"'SC4'!J15","v":0},{"$f":"'SC4'!K15","v":8049671.46}]

{"sheet":"C2-FinPerf SC","index":7,"n_rows":55,"n_cols":11,"rows_kept":55,"cut":false,"hidden":false,"merged":[[1,1,2,1],[1,0,2,0],[0,0,0,10],[54,0,54,10]]}
[{"$f":"muni& \" - \"&S71A& \" - \"&date","v":"NW375 Moses Kotane - Table C2 Monthly Budget Statement - Financial Performance (functional classification) - M07 January"}]
[{"$f":"desc","v":"Description"},{"$f":"head27","v":"Ref"},{"$f":"Head1","v":"2019/20"},{"$f":"Head2","v":"Budget Year 2020/21"}]
[null,null,{"$f":"Head5","v":"Audited Outcome"},{"$f":"Head6","v":"Original Budget"},{"$f":"Head7","v":"Adjusted Budget"},{"$f":"Head38","v":"Monthly actual"},{"$f":"Head39","v":"YearTD actual"},{"$f":"Head40","v":"YearTD budget"},{"$f":"Head41","v":"YTD variance"},{"$f":"Head41","v":"YTD variance"},{"$f":"Head8","v":"Full Year Forecast"}]
["R thousands",1,null,null,null,null,null,null,null,"%"]
["Revenue - Functional"]
["Governance and administration",null,{"$f":"SUM(C7:C9)","v":482518123.74000001},508138125,548648970,17858257.050000001,453176314.89999998,316669239.5,{"$f":"G6-H6","v":136507075.39999998},{"$f":"IF(I6=0,\"\",I6/H6)","v":0.43107147260509326},{"$f":"SUM(K7:K9)","v":548648970}]
["Executive and council",null,{"$f":"'C2C'!C7","v":1559133.26},{"$f":"'C2C'!D7","v":1827000},{"$f":"'C2C'!E7","v":1827000},{"$f":"'C2C'!F7","v":0},{"$f":"'C2C'!G7","v":1096370.07},{"$f":"'C2C'!H7","v":1065743},30627.070000000065,{"$f":"IF(I7=0,\"\",I7/H7)","v":2.873776323184864E-2},{"$f":"'C2C'!K7","v":1827000}]
["Finance and administration",null,{"$f":"'C2C'!C10","v":480958990.48000002},{"$f":"'C2C'!D10","v":506311125},{"$f":"'C2C'!E10","v":546821970},{"$f":"'C2C'!F10","v":17858257.050000001},{"$f":"'C2C'!G10","v":452079944.82999998},{"$f":"'C2C'!H10","v":315603496.5},136476448.32999998,0.43243008979147979,{"$f":"'C2C'!K10","v":546821970}]
["Internal audit",null,{"$f":"'C2C'!C24","v":0},{"$f":"'C2C'!D24","v":0},{"$f":"'C2C'!E24","v":0},{"$f":"'C2C'!F24","v":0},{"$f":"'C2C'!G24","v":0},{"$f":"'C2C'!H24","v":0},0,"",{"$f":"'C2C'!K24","v":0}]
["Community and public safety",null,{"$f":"SUM(C11:C15)","v":35940811.549999997},20221987,20221987,891556.55,901839.16,11796134,-10894294.84,-0.92354790476269599,{"$f":"SUM(K11:K15)","v":20221987}]
["Community and social services",null,{"$f":"'C2C'!C27","v":30321542.239999998},{"$f":"'C2C'!D27","v":7273512},{"$f":"'C2C'!E27","v":7273512},{"$f":"'C2C'!F27","v":4956.55},{"$f":"'C2C'!G27","v":15239.16},{"$f":"'C2C'!H27","v":4242875},-4227635.84,-0.99640829390448693,{"$f":"'C2C'!K27","v":7273512}]
["Sport and recreation",null,{"$f":"'C2C'!C49","v":5859.31},{"$f":"'C2C'!D49","v":9898475},{"$f":"'C2C'!E49","v":9898475},{"$f":"'C2C'!F49","v":0},{"$f":"'C2C'!G49","v":0},{"$f":"'C2C'!H49","v":5774097},-5774097,-1,{"$f":"'C2C'!K49","v":9898475}]
["Public safety",null,{"$f":"'C2C'!C55","v":5613410},{"$f":"'C2C'!D55","v":3050000},{"$f":"'C2C'!E55","v":3050000},{"$f":"'C2C'!F55","v":886600},{"$f":"'C2C'!G55","v":886600},{"$f":"'C2C'!H55","v":1779162},-892562,-0.50167550790765536,{"$f":"'C2C'!K55","v":3050000}]
["Housing",null,{"$f":"'C2C'!C64","v":0},{"$f":"'C2C'!D64","v":0},{"$f":"'C2C'!E64","v":0},{"$f":"'C2C'!F64","v":0},{"$f":"'C2C'!G64","v":0},{"$f":"'C2C'!H64","v":0},{"$f":"G14-H14","v":0},{"$f":"IF(I14=0,\"\",I14/H14)","v":""},{"$f":"'C2C'!K64","v":0}]
["Health",null,{"$f":"'C2C'!C67","v":0},{"$f":"'C2C'!D67","v":0},{"$f":"'C2C'!E67","v":0},{"$f":"'C2C'!F67","v":0},{"$f":"'C2C'!G67","v":0},{"$f":"'C2C'!H67","v":0},0,"",{"$f":"'C2C'!K67","v":0}]
["Economic and environmental services",null,{"$f":"SUM(C17:C19)","v":55466186.699999996},65260549,65260549,1043.48,44598.94,38068646,-38024047.060000002,-0.99882846004031778,{"$f":"SUM(K17:K19)","v":65260549}]
["Planning and development",null,{"$f":"'C2C'!C76","v":3476504.69},{"$f":"'C2C'!D76","v":4278767},{"$f":"'C2C'!E76","v":4278767},{"$f":"'C2C'!F76","v":1043.48},{"$f":"'C2C'!G76","v":44598.94},{"$f":"'C2C'!H76","v":2495941},-2451342.06,-0.98213141256143477,{"$f":"'C2C'!K76","v":4278767}]
["Road transport",null,{"$f":"'C2C'!C87","v":51989682.009999998},{"$f":"'C2C'!D87","v":60981782},{"$f":"'C2C'!E87","v":60981782},{"$f":"'C2C'!F87","v":0},{"$f":"'C2C'!G87","v":0},{"$f":"'C2C'!H87","v":35572705},-35572705,-1,{"$f":"'C2C'!K87","v":60981782}]
["Environmental protection",null,{"$f":"'C2C'!C92","v":0},{"$f":"'C2C'!D92","v":0},{"$f":"'C2C'!E92","v":0},{"$f":"'C2C'!F92","v":0},{"$f":"'C2C'!G92","v":0},{"$f":"'C2C'!H92","v":0},0,"",{"$f":"'C2C'!K92","v":0}]
["Trading services",null,{"$f":"SUM(C21:C24)","v":421601832.09000003},{"$f":"SUM(D21:D24)","v":484655184},526789339,19196155.48,205062241.98000002,303782538.5,-98720296.519999996,-0.32497027975161252,{"$f":"SUM(K21:K24)","v":526789339}]
["Energy sources",null,{"$f":"'C2C'!C100","v":15484099.17},{"$f":"'C2C'!D100","v":12265741},{"$f":"'C2C'!E100","v":12265741},{"$f":"'C2C'!F100","v":0},{"$f":"'C2C'!G100","v":0},{"$f":"'C2C'!H100","v":7155015},{"$f":"G21-H21","v":-7155015},-1,{"$f":"'C2C'!K100","v":12265741}]
["Water management",null,{"$f":"'C2C'!C104","v":312818243.48000002},{"$f":"'C2C'!D104","v":350686981},{"$f":"'C2C'!E104","v":383052336},{"$f":"'C2C'!F104","v":17985456.59},{"$f":"'C2C'!G104","v":109250221.26000001},{"$f":"'C2C'!H104","v":220750054.5},{"$f":"G22-H22","v":-111499833.23999999},-0.50509538261518294,{"$f":"'C2C'!K104","v":383052336}]
["Waste water management",null,{"$f":"'C2C'!C108","v":28295147.57},{"$f":"'C2C'!D108","v":47377755},{"$f":"'C2C'!E108","v":47377755},{"$f":"'C2C'!F108","v":301653.21999999997},{"$f":"'C2C'!G108","v":20827939.27},{"$f":"'C2C'!H108","v":27637008},{"$f":"G23-H23","v":-6809068.7300000004},-0.24637503198609634,{"$f":"'C2C'!K108","v":47377755}]
["Waste management",null,{"$f":"'C2C'!C113","v":65004341.869999997},{"$f":"'C2C'!D113","v":74324707},{"$f":"'C2C'!E113","v":84093507},{"$f":"'C2C'!F113","v":909045.67},{"$f":"'C2C'!G113","v":74984081.450000003},{"$f":"'C2C'!H113","v":48240461},{"$f":"G24-H24","v":26743620.450000003},0.55438152736558644,{"$f":"'C2C'!K113","v":84093507}]
["Other",4,{"$f":"'C2C'!C118","v":0},{"$f":"'C2C'!D118","v":0},{"$f":"'C2C'!E118","v":0},{"$f":"'C2C'!F118","v":0},{"$f":"'C2C'!G118","v":0},{"$f":"'C2C'!H118","v":0},{"$f":"G25-H25","v":0},"",{"$f":"'C2C'!K118","v":0}]
["Total Revenue - Functional",2,{"$f":"C6+C10+C16+C20+C25","v":995526954.08000004},{"$f":"D6+D10+D16+D20+D25","v":1078275845},1160920845,37947012.560000002,659184994.98000002,670316558,-11131563.020000026,-1.6606427048755711E-2,{"$f":"K6+K10+K16+K20+K25","v":1160920845}]
[]
["Expenditure - Functional"]
["Governance and administration",null,{"$f":"SUM(C30:C32)","v":333671818.81000006},323417191,345138059,65609559.349999994,186884052.56000003,199521186,{"$f":"G29-H29","v":-12637133.439999968},{"$f":"IF(I29=0,\"\",I29/H29)","v":-6.3337301132522172E-2},{"$f":"SUM(K30:K32)","v":345138059}]
["Executive and council",null,{"$f":"'C2C'!C129","v":87479429.760000005},{"$f":"'C2C'!D129","v":75047222},{"$f":"'C2C'!E129","v":85623222},{"$f":"'C2C'!F129","v":5476732.7800000003},{"$f":"'C2C'!G129","v":44741140.820000008},{"$f":"'C2C'!H129","v":49065839},-4324698.1799999923,{"$f":"IF(I30=0,\"\",I30/H30)","v":-8.8140715987756621E-2},{"$f":"'C2C'!K129","v":85623222}]
["Finance and administration",null,{"$f":"'C2C'!C132","v":242643642.99000004},{"$f":"'C2C'!D132","v":244344601},{"$f":"'C2C'!E132","v":255399469},{"$f":"'C2C'!F132","v":59818636.629999995},{"$f":"'C2C'!G132","v":139938782.45000002},{"$f":"'C2C'!H132","v":148062183},-8123400.5499999821,-5.486478981604629E-2,{"$f":"'C2C'!K132","v":255399469}]
["Internal audit",null,{"$f":"'C2C'!C146","v":3548746.06},{"$f":"'C2C'!D146","v":4025368},{"$f":"'C2C'!E146","v":4115368},{"$f":"'C2C'!F146","v":314189.94},{"$f":"'C2C'!G146","v":2204129.29},{"$f":"'C2C'!H146","v":2393164},-189034.70999999996,-7.8989450785654461E-2,{"$f":"'C2C'!K146","v":4115368}]
["Community and public safety",null,{"$f":"SUM(C34:C38)","v":101187018.22},94362294,96241094,21013683.57,51350075.640000001,55984306,-4634230.3599999994,-8.2777311913092205E-2,{"$f":"SUM(K34:K38)","v":96241094}]
["Community and social services",null,{"$f":"'C2C'!C149","v":22020872.629999999},{"$f":"'C2C'!D149","v":25180426},{"$f":"'C2C'!E149","v":25509226},{"$f":"'C2C'!F149","v":13281412.74},{"$f":"'C2C'!G149","v":17422025.469999999},{"$f":"'C2C'!H149","v":14853109},2568916.4699999988,0.17295479821766599,{"$f":"'C2C'!K149","v":25509226}]
["Sport and recreation",null,{"$f":"'C2C'!C171","v":43792225.280000001},{"$f":"'C2C'!D171","v":39415232},{"$f":"'C2C'!E171","v":39665232},{"$f":"'C2C'!F171","v":5580708.4400000004},{"$f":"'C2C'!G171","v":18128485.329999998},{"$f":"'C2C'!H171","v":23117256},-4988770.6700000018,-0.21580289070640571,{"$f":"'C2C'!K171","v":39665232}]
["Public safety",null,{"$f":"'C2C'!C177","v":35373920.310000002},{"$f":"'C2C'!D177","v":29766636},{"$f":"'C2C'!E177","v":31066636},{"$f":"'C2C'!F177","v":2151562.39},{"$f":"'C2C'!G177","v":15799564.84},{"$f":"'C2C'!H177","v":18013941},-2214376.16,-0.12292569182945587,{"$f":"'C2C'!K177","v":31066636}]
["Housing",null,{"$f":"'C2C'!C186","v":0},{"$f":"'C2C'!D186","v":0},{"$f":"'C2C'!E186","v":0},{"$f":"'C2C'!F186","v":0},{"$f":"'C2C'!G186","v":0},{"$f":"'C2C'!H186","v":0},0,"",{"$f":"'C2C'!K186","v":0}]
["Health",null,{"$f":"'C2C'!C189","v":0},{"$f":"'C2C'!D189","v":0},{"$f":"'C2C'!E189","v":0},{"$f":"'C2C'!F189","v":0},{"$f":"'C2C'!G189","v":0},{"$f":"'C2C'!H189","v":0},0,"",{"$f":"'C2C'!K189","v":0}]
["Economic and environmental services",null,{"$f":"SUM(C40:C42)","v":88577675.180000007},85219149,85219149,29049526.530000001,45985567.640000001,49711410,-3725842.3599999994,-7.4949440379985188E-2,{"$f":"SUM(K40:K42)","v":85219149}]
["Planning and development",null,{"$f":"'C2C'!C198","v":20421819.699999999},{"$f":"'C2C'!D198","v":24090808},{"$f":"'C2C'!E198","v":24090808},{"$f":"'C2C'!F198","v":-2725054.23},{"$f":"'C2C'!G198","v":8836759.6799999997},{"$f":"'C2C'!H198","v":14053172},-5216412.32,-0.37119109621656948,{"$f":"'C2C'!K198","v":24090808}]
["Road transport",null,{"$f":"'C2C'!C209","v":68155855.480000004},{"$f":"'C2C'!D209","v":61128341},{"$f":"'C2C'!E209","v":61128341},{"$f":"'C2C'!F209","v":31774580.760000002},{"$f":"'C2C'!G209","v":37148807.960000001},{"$f":"'C2C'!H209","v":35658238},1490569.9600000009,4.1801559572292972E-2,{"$f":"'C2C'!K209","v":61128341}]
["Environmental protection",null,{"$f":"'C2C'!C214","v":0},{"$f":"'C2C'!D214","v":0},{"$f":"'C2C'!E214","v":0},{"$f":"'C2C'!F214","v":0},{"$f":"'C2C'!G214","v":0},{"$f":"'C2C'!H214","v":0},0,"",{"$f":"'C2C'!K214","v":0}]
["Trading services",null,{"$f":"SUM(C44:C47)","v":482719110.36999995},{"$f":"SUM(D44:D47)","v":351978628},390469445,114483338.25,230819592.03,224566496.5,6253095.5300000161,2.7845184510860533E-2,{"$f":"SUM(K44:K47)","v":390469445}]
["Energy sources",null,{"$f":"'C2C'!C222","v":46041168.569999993},{"$f":"'C2C'!D222","v":15598588},{"$f":"'C2C'!E222","v":35598588},{"$f":"'C2C'!F222","v":3057583.01},{"$f":"'C2C'!G222","v":19595344.310000002},{"$f":"'C2C'!H222","v":19099216},496128.31000000238,2.5976370443687447E-2,{"$f":"'C2C'!K222","v":35598588}]
["Water management",null,{"$f":"'C2C'!C226","v":355501528.75999999},{"$f":"'C2C'!D226","v":272588832},{"$f":"'C2C'!E226","v":283029649},{"$f":"'C2C'!F226","v":44195602.549999997},{"$f":"'C2C'!G226","v":114658048.52000001},{"$f":"'C2C'!H226","v":164230616.5},-49572567.979999989,-0.30184729885611788,{"$f":"'C2C'!K226","v":283029649}]
["Waste water management",null,{"$f":"'C2C'!C230","v":26829536.52},{"$f":"'C2C'!D230","v":19928371},{"$f":"'C2C'!E230","v":19928371},{"$f":"'C2C'!F230","v":62546745.270000003},{"$f":"'C2C'!G230","v":70569753.730000004},{"$f":"'C2C'!H230","v":11624949},58944804.730000004,5.0705430819524455,{"$f":"'C2C'!K230","v":19928371}]
["Waste management",null,{"$f":"'C2C'!C235","v":54346876.520000003},{"$f":"'C2C'!D235","v":43862837},{"$f":"'C2C'!E235","v":51912837},{"$f":"'C2C'!F235","v":4683407.42},{"$f":"'C2C'!G235","v":25996445.469999999},{"$f":"'C2C'!H235","v":29611715},-3615269.5300000012,-0.12208916403524758,{"$f":"'C2C'!K235","v":51912837}]
["Other",null,{"$f":"'C2C'!C240","v":0},{"$f":"'C2C'!D240","v":0},{"$f":"'C2C'!E240","v":0},{"$f":"'C2C'!F240","v":0},{"$f":"'C2C'!G240","v":0},{"$f":"'C2C'!H240","v":0},0,"",{"$f":"'C2C'!K240","v":0}]
["Total Expenditure - Functional",3,{"$f":"C29+C33+C39+C43+C48","v":1006155622.58},{"$f":"D29+D33+D39+D43+D48","v":854977262},917067747,230156107.69999999,515039287.87,529783398.5,-14744110.629999951,-2.7830450466635282E-2,{"$f":"K29+K33+K39+K43+K48","v":917067747}]
["Surplus/ (Deficit) for the year",null,{"$f":"C26-C49","v":-10628668.5},223298583,243853098,-192209095.13999999,144145707.11000001,140533159.5,{"$f":"I26-I49","v":3612547.6099999249},{"$f":"IF(I50=0,\"\",I50/H50)","v":2.5706015739295499E-2},{"$f":"K26-K49","v":243853098}]
[{"$f":"head27a","v":"References"}]
["1. Government Finance Statistics Functions and Sub-functions are standardised to assist the compilation of national and international accounts for comparison purposes"]
["2. Total Revenue by functional classification must reconcile to Total Operating Revenue shown in the Financial Performance Statement"]
["3. Total Expenditure by functional classification must reconcile to total operating expenditure shown in 'Financial Performance Statement'"]
["4. All amounts must be classified under a functional classification (modified GFS). The GFS function 'Other' is only for Abbatoirs, Air Transport, Licensing and Regulation, Markets and Tourism - and if used must be supported by footnotes. Nothing else may be placed under 'Other'. Assign associate share to relevant classification"]

{"sheet":"C2C","index":8,"n_rows":257,"n_cols":11,"rows_kept":257,"cut":false,"hidden":false,"merged":[[252,0,252,10],[0,0,0,10],[1,0,2,0],[1,1,2,1]]}
[{"$f":"muni& \" - \"&S71A& \" - \"&date","v":"NW375 Moses Kotane - Table C2 Monthly Budget Statement - Financial Performance (functional classification) - M07 January"}]
[{"$f":"desc","v":"Description"},{"$f":"head27","v":"Ref"},{"$f":"Head1","v":"2019/20"},{"$f":"Head2","v":"Budget Year 2020/21"}]
[null,null,{"$f":"Head5","v":"Audited Outcome"},{"$f":"Head6","v":"Original Budget"},{"$f":"Head7","v":"Adjusted Budget"},{"$f":"Head38","v":"Monthly actual"},{"$f":"Head39","v":"YearTD actual"},{"$f":"Head40","v":"YearTD budget"},{"$f":"Head41","v":"YTD variance"},{"$f":"Head41","v":"YTD variance"},{"$f":"Head8","v":"Full Year Forecast"}]
["R thousands",1,null,null,null,null,null,null,null,"%"]
["Revenue - Functional"]
["Municipal governance and administration",null,{"$f":"C7+C10+C24","v":482518123.74000001},508138125,548648970,17858257.050000001,453176314.89999998,316669239.5,{"$f":"G6-H6","v":136507075.39999998},{"$f":"IF(I6=0,\"\",I6/H6)","v":0.43107147260509326},{"$f":"K7+K10+K24","v":548648970}]
["Executive and council",null,{"$f":"SUM(C8:C9)","v":1559133.26},{"$f":"SUM(D8:D9)","v":1827000},1827000,0,1096370.07,1065743,{"$f":"G7-H7","v":30627.070000000065},{"$f":"IF(I7=0,\"\",I7/H7)","v":2.873776323184864E-2},1827000]
["Mayor and Council",null,1559133.26,1827000,1827000,0,1096370.07,1065743,30627.070000000065,2.873776323184864E-2,1827000]
["Municipal Manager, Town Secretary and Chief Executive",null,null,null,null,null,null,null,0,""]
["Finance and administration",null,{"$f":"SUM(C11:C23)","v":480958990.48000002},506311125,546821970,17858257.050000001,452079944.82999998,315603496.5,{"$f":"G10-H10","v":136476448.32999998},{"$f":"IF(I10=0,\"\",I10/H10)","v":0.43243008979147979},{"$f":"SUM(K11:K23)","v":546821970}]
["Administrative and Corporate Support",null,0,0,0,0,0,0,0,"",0]
["Asset Management",null,null,null,null,null,null,null,0,""]
["Finance",null,480028747.56,505811125,546321970,17858257.050000001,452079944.82999998,315311834.5,136768110.32999998,0.43375508105135835,546321970]
["Fleet Management",null,290000,0,0,0,0,0,0,"",0]
["Human Resources",null,640242.92000000004,500000,500000,0,0,291662,-291662,-1,500000]
["Information Technology",null,0,0,0,0,0,0,{"$f":"G16-H16","v":0},{"$f":"IF(I16=0,\"\",I16/H16)","v":""},0]
["Legal Services",null,null,null,null,null,null,null,0,""]
["Marketing, Customer Relations, Publicity and Media Co-ordination",null,null,null,null,null,null,null,0,""]
["Property Services",null,null,null,null,null,null,null,0,""]
["Risk Management",null,null,null,null,null,null,null,0,""]
["Security Services",null,null,null,null,null,null,null,0,""]
["Supply Chain Management ",null,null,null,null,null,null,null,0,""]
["Valuation Service",null,null,null,null,null,null,null,0,""]
["Internal audit",null,{"$f":"SUM(C25:C25)","v":0},0,0,0,0,0,0,"",{"$f":"SUM(K25:K25)","v":0}]
["Governance Function",null,null,null,null,null,null,null,0,""]
["Community and public safety",null,{"$f":"C27+C49+C55+C64+C67","v":35940811.549999997},{"$f":"D27+D49+D55+D64+D67","v":20221987},20221987,891556.55,901839.16,11796134,-10894294.84,-0.92354790476269599,20221987]
["Community and social services",null,{"$f":"SUM(C28:C48)","v":30321542.239999998},7273512,7273512,4956.55,15239.16,4242875,-4227635.84,-0.99640829390448693,{"$f":"SUM(K28:K48)","v":7273512}]
["Aged Care",null,null,null,null,null,null,null,{"$f":"G28-H28","v":0},{"$f":"IF(I28=0,\"\",I28/H28)","v":""}]
["Agricultural",null,null,null,null,null,null,null,0,""]
["Animal Care and Diseases",null,null,null,null,null,null,null,0,""]
["Cemeteries, Funeral Parlours and Crematoriums",null,11727.79,10000,10000,4956.55,8021.77,5831,2190.7700000000004,0.37571085577087987,10000]
["Child Care Facilities",null,null,null,null,null,null,null,0,""]
["Community Halls and Facilities",null,29638422.809999999,7223512,7223512,0,0,4213713,-4213713,-1,7223512]
["Consumer Protection",null,null,null,null,null,null,null,0,""]
["Cultural Matters",null,null,null,null,null,null,null,{"$f":"G35-H35","v":0},{"$f":"IF(I35=0,\"\",I35/H35)","v":""}]
["Disaster Management",null,null,null,null,null,null,null,0,""]
["Education",null,null,null,null,null,null,null,0,""]
["Indigenous and Customary Law",null,null,null,null,null,null,null,0,""]
["Industrial Promotion",null,null,null,null,null,null,null,0,""]
["Language Policy",null,null,null,null,null,null,null,0,""]
["Libraries and Archives",null,671391.64,40000,40000,0,7217.39,23331,-16113.61,-0.69065235094938071,40000]
["Literacy Programmes",null,null,null,null,null,null,null,0,""]
["Media Services",null,null,null,null,null,null,null,0,""]
["Museums and Art Galleries",null,null,null,null,null,null,null,0,""]
["Population Development",null,null,null,null,null,null,null,0,""]
["Provincial Cultural Matters",null,null,null,null,null,null,null,0,""]
["Theatres",null,null,null,null,null,null,null,0,""]
["Zoo's",null,null,null,null,null,null,null,0,""]
["Sport and recreation",null,{"$f":"SUM(C50:C54)","v":5859.31},{"$f":"SUM(D50:D54)","v":9898475},9898475,0,0,5774097,{"$f":"G49-H49","v":-5774097},{"$f":"IF(I49=0,\"\",I49/H49)","v":-1},9898475]
["Beaches and Jetties ",null,null,null,null,null,null,null,0,""]
["Casinos, Racing, Gambling, Wagering",null,null,null,null,null,null,null,0,""]
["Community Parks (including Nurseries)",null,null,null,null,null,null,null,0,""]
["Recreational Facilities",null,5859.31,9898475,9898475,0,0,5774097,-5774097,-1,9898475]
["Sports Grounds and Stadiums",null,null,null,null,null,null,null,0,""]
["Public safety",null,{"$f":"SUM(C56:C63)","v":5613410},{"$f":"SUM(D56:D63)","v":3050000},3050000,886600,886600,1779162,-892562,-0.50167550790765536,3050000]
["Civil Defence",null,0,0,0,0,0,0,0,"",0]
["Cleansing",null,null,null,null,null,null,null,0,""]
["Control of Public Nuisances",null,null,null,null,null,null,null,{"$f":"G58-H58","v":0},{"$f":"IF(I58=0,\"\",I58/H58)","v":""}]
["Fencing and Fences ",null,null,null,null,null,null,null,0,""]
["Fire Fighting and Protection",null,null,null,null,null,null,null,0,""]
["Licensing and Control of Animals",null,null,null,null,null,null,null,{"$f":"G61-H61","v":0},{"$f":"IF(I61=0,\"\",I61/H61)","v":""}]
["Police Forces, Traffic and Street Parking Control",null,5613410,3050000,3050000,886600,886600,1779162,{"$f":"G62-H62","v":-892562},{"$f":"IF(I62=0,\"\",I62/H62)","v":-0.50167550790765536},3050000]
["Pounds",null,null,null,null,null,null,null,0,""]
["Housing",null,{"$f":"SUM(C65:C66)","v":0},0,0,0,0,0,{"$f":"G64-H64","v":0},{"$f":"IF(I64=0,\"\",I64/H64)","v":""},{"$f":"SUM(K65:K66)","v":0}]
["Housing",null,null,null,null,null,null,null,{"$f":"G65-H65","v":0},{"$f":"IF(I65=0,\"\",I65/H65)","v":""}]
["Informal Settlements",null,null,null,null,null,null,null,{"$f":"G66-H66","v":0},{"$f":"IF(I66=0,\"\",I66/H66)","v":""}]
["Health",null,{"$f":"SUM(C68:C74)","v":0},0,0,0,0,0,0,"",{"$f":"SUM(K68:K74)","v":0}]
["Ambulance",null,null,null,null,null,null,null,0,""]
["Health Services",null,null,null,null,null,null,null,0,""]
["Laboratory Services",null,null,null,null,null,null,null,{"$f":"G70-H70","v":0},{"$f":"IF(I70=0,\"\",I70/H70)","v":""}]
["Food Control",null,null,null,null,null,null,null,{"$f":"G71-H71","v":0},{"$f":"IF(I71=0,\"\",I71/H71)","v":""}]
["Health Surveillance and Prevention of Communicable Diseases including immunizations",null,null,null,null,null,null,null,0,""]
["Vector Control",null,null,null,null,null,null,null,0,""]
["Chemical Safety",null,null,null,null,null,null,null,0,""]
["Economic and environmental services",null,{"$f":"C76+C87+C92","v":55466186.699999996},65260549,65260549,1043.48,44598.94,38068646,-38024047.060000002,-0.99882846004031778,{"$f":"K76+K87+K92","v":65260549}]
["Planning and development",null,{"$f":"SUM(C77:C86)","v":3476504.69},4278767,4278767,1043.48,44598.94,2495941,-2451342.06,-0.98213141256143477,{"$f":"SUM(K77:K86)","v":4278767}]
["Billboards",null,null,null,null,null,null,null,{"$f":"G77-H77","v":0},{"$f":"IF(I77=0,\"\",I77/H77)","v":""}]
["Corporate Wide Strategic Planning (IDPs, LEDs)",null,null,null,null,null,null,null,0,""]
["Central City Improvement District",null,null,null,null,null,null,null,0,""]
["Development Facilitation",null,null,null,null,null,null,null,{"$f":"G80-H80","v":0},{"$f":"IF(I80=0,\"\",I80/H80)","v":""}]
["Economic Development/Planning",null,0,0,0,0,0,0,{"$f":"G81-H81","v":0},{"$f":"IF(I81=0,\"\",I81/H81)","v":""},0]
["Regional Planning and Development",null,null,null,null,null,null,null,{"$f":"G82-H82","v":0},{"$f":"IF(I82=0,\"\",I82/H82)","v":""}]
["Town Planning, Building Regulations and Enforcement, and City Engineer",null,133969.78,100000,100000,1043.48,44598.94,58331,{"$f":"G83-H83","v":-13732.059999999998},{"$f":"IF(I83=0,\"\",I83/H83)","v":-0.23541615950352296},100000]
["Project Management Unit",null,3342534.91,4178767,4178767,0,0,2437610,-2437610,-1,4178767]
["Provincial Planning",null,null,null,null,null,null,null,0,""]
["Support to Local Municipalities",null,null,null,null,null,null,null,0,""]
["Road transport",null,{"$f":"SUM(C88:C91)","v":51989682.009999998},60981782,60981782,0,0,35572705,-35572705,-1,{"$f":"SUM(K88:K91)","v":60981782}]
["Public Transport",null,null,null,null,null,null,null,0,""]
["Road and Traffic Regulation",null,null,null,null,null,null,null,0,""]
["Roads",null,51989682.009999998,60981782,60981782,0,0,35572705,-35572705,-1,60981782]
["Taxi Ranks",null,null,null,null,null,null,null,0,""]
["Environmental protection",null,{"$f":"SUM(C93:C98)","v":0},{"$f":"SUM(D93:D98)","v":0},0,0,0,0,0,"",0]
["Biodiversity and Landscape",null,null,null,null,null,null,null,0,""]
["Coastal Protection",null,null,null,null,null,null,null,0,""]
["Indigenous Forests",null,null,null,null,null,null,null,{"$f":"G95-H95","v":0},{"$f":"IF(I95=0,\"\",I95/H95)","v":""}]
["Nature Conservation",null,null,null,null,null,null,null,{"$f":"G96-H96","v":0},{"$f":"IF(I96=0,\"\",I96/H96)","v":""}]
["Pollution Control",null,null,null,null,null,null,null,0,""]
["Soil Conservation",null,null,null,null,null,null,null,0,""]
["Trading services",null,{"$f":"C100+C104+C108+C113","v":421601832.09000003},{"$f":"D100+D104+D108+D113","v":484655184},526789339,19196155.48,205062241.98000002,303782538.5,-98720296.519999996,-0.32497027975161252,{"$f":"K100+K104+K108+K113","v":526789339}]
["Energy sources",null,{"$f":"SUM(C101:C103)","v":15484099.17},{"$f":"SUM(D101:D103)","v":12265741},12265741,0,0,7155015,-7155015,-1,12265741]
["Electricity ",null,null,null,null,null,null,null,0,""]
["Street Lighting and Signal Systems",null,15484099.17,12265741,12265741,0,0,7155015,{"$f":"G102-H102","v":-7155015},{"$f":"IF(I102=0,\"\",I102/H102)","v":-1},12265741]
["Nonelectric Energy",null,null,null,null,null,null,null,0,""]
["Water management",null,{"$f":"SUM(C105:C107)","v":312818243.48000002},{"$f":"SUM(D105:D107)","v":350686981},383052336,17985456.59,109250221.26000001,220750054.5,-111499833.23999999,-0.50509538261518294,383052336]
["Water Treatment",null,224818243.47999999,254799981,254799981,17985456.59,96234866.260000005,148633303,-52398436.739999995,-0.35253496815582436,254799981]
["Water Distribution",null,88000000,95887000,128252355,0,13015355,72116751.5,{"$f":"G106-H106","v":-59101396.5},{"$f":"IF(I106=0,\"\",I106/H106)","v":-0.81952383143602914},128252355]
["Water Storage",null,null,null,null,null,null,null,0,""]
["Waste water management",null,{"$f":"SUM(C109:C112)","v":28295147.57},{"$f":"SUM(D109:D112)","v":47377755},47377755,301653.21999999997,20827939.27,27637008,-6809068.7300000004,-0.24637503198609634,47377755]
["Public Toilets",null,null,null,null,null,null,null,0,""]
["Sewerage",null,28295147.57,47377755,47377755,301653.21999999997,20827939.27,27637008,-6809068.7300000004,-0.24637503198609634,47377755]
["Storm Water Management",null,0,0,0,0,0,0,{"$f":"G111-H111","v":0},{"$f":"IF(I111=0,\"\",I111/H111)","v":""},0]
["Waste Water Treatment",null,null,null,null,null,null,null,0,""]
["Waste management",null,{"$f":"SUM(C114:C117)","v":65004341.869999997},74324707,84093507,909045.67,74984081.450000003,48240461,26743620.450000003,0.55438152736558644,{"$f":"SUM(K114:K117)","v":84093507}]
["Recycling",null,null,null,null,null,null,null,{"$f":"G114-H114","v":0},{"$f":"IF(I114=0,\"\",I114/H114)","v":""}]
["Solid Waste Disposal (Landfill Sites)",null,null,null,null,null,null,null,{"$f":"G115-H115","v":0},{"$f":"IF(I115=0,\"\",I115/H115)","v":""}]
["Solid Waste Removal",null,65004341.869999997,74324707,84093507,909045.67,74984081.450000003,48240461,26743620.450000003,0.55438152736558644,84093507]
["Street Cleaning",null,null,null,null,null,null,null,{"$f":"G117-H117","v":0},{"$f":"IF(I117=0,\"\",I117/H117)","v":""}]
["Other",null,{"$f":"SUM(C119:C124)","v":0},{"$f":"SUM(D119:D124)","v":0},0,0,0,0,0,"",0]
["Abattoirs",null,null,null,null,null,null,null,0,""]
["Air Transport",null,null,null,null,null,null,null,0,""]
["Forestry ",null,null,null,null,null,null,null,{"$f":"G121-H121","v":0},{"$f":"IF(I121=0,\"\",I121/H121)","v":""}]
["Licensing and Regulation",null,null,null,null,null,null,null,0,""]
["Markets",null,null,null,null,null,null,null,0,""]
["Tourism",null,null,null,null,null,null,null,{"$f":"G124-H124","v":0},{"$f":"IF(I124=0,\"\",I124/H124)","v":""}]
[{"$f":"\"Total \"&A5","v":"Total Revenue - Functional"},2,{"$f":"C6+C26+C75+C99+C118","v":995526954.08000004},1078275845,1160920845,37947012.560000002,659184994.98000002,670316558,{"$f":"G125-H125","v":-11131563.019999981},{"$f":"IF(I125=0,\"\",I125/H125)","v":-1.6606427048755642E-2},{"$f":"K6+K26+K75+K99+K118","v":1160920845}]
[]
["Expenditure - Functional"]
[{"$f":"A6","v":"Municipal governance and administration"},null,{"$f":"C129+C132+C146","v":333671818.81000006},323417191,345138059,65609559.349999994,186884052.56000003,199521186,{"$f":"G128-H128","v":-12637133.439999968},{"$f":"IF(I128=0,\"\",I128/H128)","v":-6.3337301132522172E-2},{"$f":"K129+K132+K146","v":345138059}]
["Executive and council",null,{"$f":"SUM(C130:C131)","v":87479429.760000005},75047222,85623222,5476732.7800000003,44741140.820000008,49065839,-4324698.1799999923,-8.8140715987756621E-2,85623222]
["Mayor and Council",null,69162409.310000002,60038020,68784020,4654306.71,37634512.840000004,39395358,-1760845.1599999964,-4.4696767573478999E-2,68784020]
["Municipal Manager, Town Secretary and Chief Executive",null,18317020.449999999,15009202,16839202,822426.07,7106627.9800000004,9670481,-2563853.0199999996,-0.26512156117156938,16839202]
["Finance and administration",null,{"$f":"SUM(C133:C145)","v":242643642.99000004},244344601,255399469,59818636.629999995,139938782.45000002,148062183,-8123400.5499999821,-5.486478981604629E-2,{"$f":"SUM(K133:K145)","v":255399469}]
["Administrative and Corporate Support",null,38026277.32,40317622,43611622,2906212.45,24440959.84,25165705,-724745.16000000015,-2.8798921389247795E-2,43611622]
["Asset Management",null,3069358.44,11587935,11587935,285486.59000000003,3110076.16,6759648,-3649571.84,-0.53990560455218972,11587935]
["Finance",null,100924570.52,120915478,123229346,47772112.670000002,80799042.340000004,71691083,9107959.3400000036,0.12704452156204704,123229346]
["Fleet Management",null,15037335.279999999,18271527,18271527,3318053.62,9944685.4299999997,10658445,-713759.5700000003,-6.6966576268864764E-2,18271527]
["Human Resources",null,11312659.960000001,15769578,18216578,746176.21,6567948.3600000003,10422459,-3854510.6399999997,-0.36982737375124236,18216578]
["Information Technology",null,65317667.810000002,27329546,30329546,4033972.68,9940053.9199999999,17442262,-7502208.0800000001,-0.43011669472686515,30329546]
["Legal Services",null,1161607.3,1309413,1309413,103603.25,750249.07,763833,-13583.930000000051,-1.7783900407549885E-2,1309413]
["Marketing, Customer Relations, Publicity and Media Co-ordination",null,null,null,null,null,null,null,0,""]
["Property Services",null,null,null,null,null,null,null,0,""]
["Risk Management",null,0,941888,941888,0,0,549451,-549451,-1,941888]
["Security Services",null,null,null,null,null,null,null,0,""]
["Supply Chain Management ",null,7794166.3600000003,7901614,7901614,653019.16,4385767.33,4609297,-223529.66999999993,-4.8495393115262464E-2,7901614]
["Valuation Service",null,null,null,null,null,null,null,0,""]
["Internal audit",null,{"$f":"SUM(C147:C147)","v":3548746.06},4025368,4115368,314189.94,2204129.29,2393164,-189034.70999999996,-7.8989450785654461E-2,{"$f":"SUM(K147:K147)","v":4115368}]
["Governance Function",null,3548746.06,4025368,4115368,314189.94,2204129.29,2393164,-189034.70999999996,-7.8989450785654461E-2,4115368]
["Community and public safety",null,{"$f":"C149+C171+C177+C186+C189","v":101187018.22},94362294,96241094,21013683.57,51350075.640000001,55984306,-4634230.3599999994,-8.2777311913092205E-2,{"$f":"K149+K171+K177+K186+K189","v":96241094}]
["Community and social services",null,{"$f":"SUM(C150:C170)","v":22020872.629999999},25180426,25509226,13281412.74,17422025.469999999,14853109,2568916.4699999988,0.17295479821766599,{"$f":"SUM(K150:K170)","v":25509226}]
["Aged Care",null,null,null,null,null,null,null,0,""]
["Agricultural",null,0,8157250,8157250,4493619.33,4493619.33,4758418,-264798.66999999993,-5.5648467620961407E-2,8157250]
["Animal Care and Diseases",null,null,null,null,null,null,null,0,""]
["Cemeteries, Funeral Parlours and Crematoriums",null,0,3978010,3978010,0,0,2320535,-2320535,-1,3978010]
["Child Care Facilities",null,null,null,null,null,null,null,0,""]
["Community Halls and Facilities",null,19613207.760000002,8784996,8784996,8668485.8900000006,12137648.609999999,5124595,7013053.6099999994,1.3685088499676559,8784996]
["Consumer Protection",null,null,null,null,null,null,null,0,""]
["Cultural Matters",null,null,null,null,null,null,null,{"$f":"G157-H157","v":0},{"$f":"IF(I157=0,\"\",I157/H157)","v":""}]
["Disaster Management",null,29958.9,2486022,2814822,0,86100,1614604,{"$f":"G158-H158","v":-1528504},{"$f":"IF(I158=0,\"\",I158/H158)","v":-0.94667423095694048},2814822]
["Education",null,null,null,null,null,null,null,{"$f":"G159-H159","v":0},{"$f":"IF(I159=0,\"\",I159/H159)","v":""}]
[{"$f":"A38","v":"Indigenous and Customary Law"},null,null,null,null,null,null,null,0,""]
["Industrial Promotion",null,null,null,null,null,null,null,0,""]
["Language Policy",null,null,null,null,null,null,null,0,""]
["Libraries and Archives",null,2377705.9700000002,1774148,1774148,119307.52,704657.53,1034957,-330299.46999999997,-0.31914318179402618,1774148]
["Literacy Programmes",null,null,null,null,null,null,null,0,""]
["Media Services",null,0,0,0,0,0,0,0,"",0]
["Museums and Art Galleries",null,0,0,0,0,0,0,0,"",0]
["Population Development",null,null,null,null,null,null,null,0,""]
["Provincial Cultural Matters",null,null,null,null,null,null,null,0,""]
["Theatres",null,null,null,null,null,null,null,0,""]
["Zoo's",null,null,null,null,null,null,null,0,""]
["Sport and recreation",null,{"$f":"SUM(C172:C176)","v":43792225.280000001},39415232,39665232,5580708.4400000004,18128485.329999998,23117256,{"$f":"G171-H171","v":-4988770.6700000018},{"$f":"IF(I171=0,\"\",I171/H171)","v":-0.21580289070640571},39665232]
["Beaches and Jetties ",null,null,null,null,null,null,null,0,""]
["Casinos, Racing, Gambling, Wagering",null,null,null,null,null,null,null,0,""]
["Community Parks (including Nurseries)",null,null,null,null,null,null,null,0,""]
["Recreational Facilities",null,43792225.280000001,39415232,39665232,5580708.4400000004,18128485.329999998,23117256,-4988770.6700000018,-0.21580289070640571,39665232]
["Sports Grounds and Stadiums",null,null,null,null,null,null,null,0,""]
["Public safety",null,{"$f":"SUM(C178:C185)","v":35373920.310000002},29766636,31066636,2151562.39,15799564.84,18013941,-2214376.16,-0.12292569182945587,31066636]
["Civil Defence",null,23287789.82,19897500,21097500,1732719.3,12276426.189999999,12206903,69523.189999999478,5.6953995620346518E-3,21097500]
["Cleansing",null,null,null,null,null,null,null,0,""]
["Control of Public Nuisances",null,null,null,null,null,null,null,{"$f":"G180-H180","v":0},{"$f":"IF(I180=0,\"\",I180/H180)","v":""}]
["Fencing and Fences ",null,null,null,null,null,null,null,0,""]
["Fire Fighting and Protection",null,0,0,0,0,0,0,0,"",0]
["Licensing and Control of Animals",null,null,null,null,null,null,null,{"$f":"G183-H183","v":0},{"$f":"IF(I183=0,\"\",I183/H183)","v":""}]
["Police Forces, Traffic and Street Parking Control",null,12086130.49,9869136,9969136,418843.09,3523138.65,5807038,{"$f":"G184-H184","v":-2283899.35},{"$f":"IF(I184=0,\"\",I184/H184)","v":-0.39329850261010862},9969136]
["Pounds",null,null,null,null,null,null,null,0,""]
["Housing",null,{"$f":"SUM(C187:C188)","v":0},0,0,0,0,0,{"$f":"G186-H186","v":0},{"$f":"IF(I186=0,\"\",I186/H186)","v":""},{"$f":"SUM(K187:K188)","v":0}]
["Housing",null,null,null,null,null,null,null,{"$f":"G187-H187","v":0},{"$f":"IF(I187=0,\"\",I187/H187)","v":""}]
["Informal Settlements",null,null,null,null,null,null,null,{"$f":"G188-H188","v":0},{"$f":"IF(I188=0,\"\",I188/H188)","v":""}]
["Health",null,{"$f":"SUM(C190:C196)","v":0},0,0,0,0,0,0,"",0]
["Ambulance",null,null,null,null,null,null,null,0,""]
["Health Services",null,null,null,null,null,null,null,0,""]
[{"$f":"A70","v":"Laboratory Services"},null,null,null,null,null,null,null,0,""]
["Food Control",null,null,null,null,null,null,null,{"$f":"G193-H193","v":0},{"$f":"IF(I193=0,\"\",I193/H193)","v":""}]
["Health Surveillance and Prevention of Communicable Diseases including immunizations",null,null,null,null,null,null,null,{"$f":"G194-H194","v":0},{"$f":"IF(I194=0,\"\",I194/H194)","v":""}]
["Vector Control",null,null,null,null,null,null,null,0,""]
["Chemical Safety",null,null,null,null,null,null,null,0,""]
["Economic and environmental services",null,{"$f":"C198+C209+C214","v":88577675.180000007},85219149,85219149,29049526.530000001,45985567.640000001,49711410,-3725842.3599999994,-7.4949440379985188E-2,{"$f":"K198+K209+K214","v":85219149}]
["Planning and development",null,{"$f":"SUM(C199:C208)","v":20421819.699999999},24090808,24090808,-2725054.23,8836759.6799999997,14053172,-5216412.32,-0.37119109621656948,24090808]
["Billboards",null,null,null,null,null,null,null,0,""]
["Corporate Wide Strategic Planning (IDPs, LEDs)",null,0,7380884,7380884,853848.48,1126148.48,4305567,-3179418.52,-0.73844362891112836,7380884]
["Central City Improvement District",null,null,null,null,null,null,null,0,""]
["Development Facilitation",null,0,0,0,0,0,0,{"$f":"G202-H202","v":0},{"$f":"IF(I202=0,\"\",I202/H202)","v":""},0]
["Economic Development/Planning",null,14381748.33,8681821,8681821,-4048417,3647223.11,5064465,{"$f":"G203-H203","v":-1417241.8900000001},{"$f":"IF(I203=0,\"\",I203/H203)","v":-0.27984039577724401},8681821]
["Regional Planning and Development",null,null,null,null,null,null,null,{"$f":"G204-H204","v":0},{"$f":"IF(I204=0,\"\",I204/H204)","v":""}]
["Town Planning, Building Regulations and Enforcement, and City Engineer",null,2841470.73,3849336,3849336,269898.45,2059442.86,2245488,{"$f":"G205-H205","v":-186045.1399999999},{"$f":"IF(I205=0,\"\",I205/H205)","v":-8.2852876523944866E-2},3849336]
["Project Management Unit",null,3198600.64,4178767,4178767,199615.84,2003945.23,2437652,{"$f":"G206-H206","v":-433706.77},{"$f":"IF(I206=0,\"\",I206/H206)","v":-0.17791988766238989},4178767]
["Provincial Planning",null,null,null,null,null,null,null,0,""]
["Support to Local Municipalities",null,null,null,null,null,null,null,0,""]
["Road transport",null,{"$f":"SUM(C210:C213)","v":68155855.480000004},61128341,61128341,31774580.760000002,37148807.960000001,35658238,1490569.9600000009,4.1801559572292972E-2,{"$f":"SUM(K210:K213)","v":61128341}]
["Public Transport",null,null,null,null,null,null,null,0,""]
["Road and Traffic Regulation",null,null,null,null,null,null,null,{"$f":"G211-H211","v":0},{"$f":"IF(I211=0,\"\",I211/H211)","v":""}]
["Roads",null,68155855.480000004,61128341,61128341,31774580.760000002,37148807.960000001,35658238,1490569.9600000009,4.1801559572292972E-2,61128341]
["Taxi Ranks",null,null,null,null,null,null,null,0,""]
["Environmental protection",null,{"$f":"SUM(C215:C220)","v":0},0,0,0,0,0,0,"",0]
["Biodiversity and Landscape",null,null,null,null,null,null,null,0,""]
["Coastal Protection",null,null,null,null,null,null,null,0,""]
["Indigenous Forests",null,null,null,null,null,null,null,0,""]
["Nature Conservation",null,null,null,null,null,null,null,{"$f":"G218-H218","v":0},{"$f":"IF(I218=0,\"\",I218/H218)","v":""}]
["Pollution Control",null,null,null,null,null,null,null,{"$f":"G219-H219","v":0},{"$f":"IF(I219=0,\"\",I219/H219)","v":""}]
["Soil Conservation",null,null,null,null,null,null,null,0,""]
["Trading services",null,{"$f":"C222+C226+C230+C235","v":482719110.36999995},{"$f":"D222+D226+D230+D235","v":351978628},390469445,114483338.25,230819592.03,224566496.5,6253095.5300000161,2.7845184510860533E-2,{"$f":"K222+K226+K230+K235","v":390469445}]
["Energy sources",null,{"$f":"SUM(C223:C225)","v":46041168.569999993},15598588,35598588,3057583.01,19595344.310000002,19099216,496128.31000000238,2.5976370443687447E-2,35598588]
["Electricity ",null,24541751.579999998,8000000,28000000,1253988.75,14905104.9,14666669,238435.90000000037,1.6256990595478794E-2,28000000]
[{"$f":"A102","v":"Street Lighting and Signal Systems"},null,21499416.989999998,7598588,7598588,1803594.26,4690239.41,4432547,{"$f":"G224-H224","v":257692.41000000015},{"$f":"IF(I224=0,\"\",I224/H224)","v":5.8136419083655549E-2},7598588]
["Nonelectric Energy",null,null,null,null,null,null,null,0,""]
["Water management",null,{"$f":"SUM(C227:C229)","v":355501528.75999999},272588832,283029649,44195602.549999997,114658048.52000001,164230616.5,-49572567.979999989,-0.30184729885611788,283029649]
["Water Treatment",null,48321073.229999997,42397321,41638138,2780907.22,26031131.210000001,24352206.5,1678924.7100000009,6.8943432702905219E-2,41638138]
["Water Distribution",null,307180455.52999997,230191511,241391511,41414695.329999998,88626917.310000002,139878410,{"$f":"G228-H228","v":-51251492.689999998},{"$f":"IF(I228=0,\"\",I228/H228)","v":-0.36640030931149414},241391511]
["Water Storage",null,0,0,0,0,0,0,0,"",0]
["Waste water management",null,{"$f":"SUM(C231:C234)","v":26829536.52},19928371,19928371,62546745.270000003,70569753.730000004,11624949,58944804.730000004,5.0705430819524455,19928371]
["Public Toilets",null,null,null,null,null,null,null,0,""]
["Sewerage",null,26829536.52,19928371,19928371,62546745.270000003,70569753.730000004,11624949,58944804.730000004,5.0705430819524455,19928371]
["Storm Water Management",null,0,0,0,0,0,0,{"$f":"G233-H233","v":0},{"$f":"IF(I233=0,\"\",I233/H233)","v":""},0]
["Waste Water Treatment",null,null,null,null,null,null,null,0,""]
["Waste management",null,{"$f":"SUM(C236:C239)","v":54346876.520000003},43862837,51912837,4683407.42,25996445.469999999,29611715,-3615269.5300000012,-0.12208916403524758,{"$f":"SUM(K236:K239)","v":51912837}]
["Recycling",null,null,null,null,null,null,null,{"$f":"G236-H236","v":0},{"$f":"IF(I236=0,\"\",I236/H236)","v":""}]
["Solid Waste Disposal (Landfill Sites)",null,null,null,null,null,null,null,{"$f":"G237-H237","v":0},{"$f":"IF(I237=0,\"\",I237/H237)","v":""}]
["Solid Waste Removal",null,54346876.520000003,43862837,51912837,4683407.42,25996445.469999999,29611715,{"$f":"G238-H238","v":-3615269.5300000012},{"$f":"IF(I238=0,\"\",I238/H238)","v":-0.12208916403524758},51912837]
["Street Cleaning",null,null,null,null,null,null,null,0,""]
["Other",null,{"$f":"SUM(C241:C246)","v":0},0,0,0,0,0,0,"",0]
["Abattoirs",null,null,null,null,null,null,null,0,""]
["Air Transport",null,null,null,null,null,null,null,0,""]
["Forestry ",null,null,null,null,null,null,null,{"$f":"G243-H243","v":0},{"$f":"IF(I243=0,\"\",I243/H243)","v":""}]
["Licensing and Regulation",null,null,null,null,null,null,null,0,""]
["Markets",null,null,null,null,null,null,null,{"$f":"G245-H245","v":0},{"$f":"IF(I245=0,\"\",I245/H245)","v":""}]
["Tourism",null,0,0,0,0,0,0,{"$f":"G246-H246","v":0},{"$f":"IF(I246=0,\"\",I246/H246)","v":""},0]
[{"$f":"\"Total \"&A127","v":"Total Expenditure - Functional"},3,{"$f":"C128+C148+C197+C221+C240","v":1006155622.58},854977262,917067747,230156107.69999999,515039287.87,529783398.5,-14744110.629999951,{"$f":"IF(I247=0,\"\",I247/H247)","v":-2.7830450466635282E-2},{"$f":"K128+K148+K197+K221+K240","v":917067747}]
[{"$f":"result","v":"Surplus/ (Deficit) for the year"},null,{"$f":"C125-C247","v":-10628668.5},223298583,243853098,-192209095.13999999,144145707.11000001,140533159.5,{"$f":"G248-H248","v":3612547.6100000143},{"$f":"IF(I248=0,\"\",I248/H248)","v":2.5706015739296137E-2},{"$f":"K125-K247","v":243853098}]
[{"$f":"head27a","v":"References"}]
["1. Government Finance Statistics Functions and Sub-functions are standardised to assist national and international accounts and comparison"]
["2. Total Revenue by Functional Classification must reconcile to total operating revenue shown in Financial Performance (revenue and expenditure)"]
["3. Total Expenditure by Functional Classification must reconcile to total operating expenditure shown in Financial Performance (revenue and expenditure)"]
["4. All amounts must be classified under a Functional classification. The function 'Other' is only for Abbatoirs, Air Transport, Licensing and Regulation, Markets and Tourism - and if used must be supported by footnotes. Nothing else may be placed under 'Other'. Assign associate share to relevant classification"]
[]
[]
["check oprev balance",null,{"$f":"C125-'C4-FinPerf RE'!C53","v":0},{"$f":"D125-'C4-FinPerf RE'!D53","v":0},{"$f":"E125-'C4-FinPerf RE'!E53","v":0},{"$f":"F125-'C4-FinPerf RE'!F53","v":0},{"$f":"G125-'C4-FinPerf RE'!G53","v":0},{"$f":"H125-'C4-FinPerf RE'!H53","v":0},{"$f":"I125-'C4-FinPerf RE'!I53","v":-11131563.019999981},null,{"$f":"K125-'C4-FinPerf RE'!K53","v":0}]
["check opexp balance",null,{"$f":"C247-'C4-FinPerf RE'!C36","v":0},{"$f":"D247-'C4-FinPerf RE'!D36","v":0},{"$f":"E247-'C4-FinPerf RE'!E36","v":0},{"$f":"F247-'C4-FinPerf RE'!F36","v":0},{"$f":"G247-'C4-FinPerf RE'!G36","v":0},{"$f":"H247-'C4-FinPerf RE'!H36","v":0},{"$f":"I247-'C4-FinPerf RE'!I36","v":1.0430812835693359E-7},null,{"$f":"K247-'C4-FinPerf RE'!K36","v":0}]

{"sheet":"C3-FinPerf V","index":9,"n_rows":43,"n_cols":11,"rows_kept":43,"cut":false,"hidden":false,"merged":[[0,0,0,10],[1,1,3,1],[1,3,1,10]]}
[{"$f":"muni& \" - \"&S71C& \" - \"&date","v":"NW375 Moses Kotane - Table C3 Monthly Budget Statement - Financial Performance (revenue and expenditure by municipal vote) - M07 January"}]
[{"$f":"Vdesc","v":"Vote Description"},{"$f":"head27","v":"Ref"},{"$f":"Head1","v":"2019/20"},{"$f":"Head2","v":"Budget Year 2020/21"}]
[null,null,{"$f":"Head5","v":"Audited Outcome"},{"$f":"Head6","v":"Original Budget"},{"$f":"Head7","v":"Adjusted Budget"},{"$f":"Head38","v":"Monthly actual"},{"$f":"Head39","v":"YearTD actual"},{"$f":"Head40","v":"YearTD budget"},{"$f":"Head41","v":"YTD variance"},{"$f":"Head41","v":"YTD variance"},{"$f":"Head8","v":"Full Year Forecast"}]
["R thousands",null,null,null,null,null,null,null,null,"%"]
["Revenue by Vote",1]
[{"$f":"'Org structure'!A2","v":"Vote 01 - Municipal Council"},null,{"$f":"'C3C'!C6","v":1559133.26},{"$f":"'C3C'!D6","v":1827000},{"$f":"'C3C'!E6","v":1827000},{"$f":"'C3C'!F6","v":0},{"$f":"'C3C'!G6","v":1096370.07},{"$f":"'C3C'!H6","v":1065743},{"$f":"G6-H6","v":30627.070000000065},{"$f":"IF(I6=0,\"\",I6/H6)","v":2.873776323184864E-2},{"$f":"'C3C'!K6","v":1827000}]
[{"$f":"'Org structure'!A3","v":"Vote 02 - Office Of The Accounting Officer"},null,{"$f":"'C3C'!C12","v":0},{"$f":"'C3C'!D12","v":0},{"$f":"'C3C'!E12","v":0},{"$f":"'C3C'!F12","v":0},{"$f":"'C3C'!G12","v":0},{"$f":"'C3C'!H12","v":0},0,"",{"$f":"'C3C'!K12","v":0}]
[{"$f":"'Org structure'!A4","v":"Vote 03 - Budget And Treasury Office"},null,{"$f":"'C3C'!C19","v":480028747.55999994},{"$f":"'C3C'!D19","v":505811125},{"$f":"'C3C'!E19","v":546321970},{"$f":"'C3C'!F19","v":17858257.049999997},{"$f":"'C3C'!G19","v":452079944.83000004},{"$f":"'C3C'!H19","v":315311834.5},136768110.33000004,0.43375508105135852,{"$f":"'C3C'!K19","v":546321970}]
[{"$f":"'Org structure'!A5","v":"Vote 04 - Corporate Services"},null,{"$f":"'C3C'!C27","v":640242.92000000004},{"$f":"'C3C'!D27","v":500000},{"$f":"'C3C'!E27","v":500000},{"$f":"'C3C'!F27","v":0},{"$f":"'C3C'!G27","v":0},{"$f":"'C3C'!H27","v":291662},-291662,-1,{"$f":"'C3C'!K27","v":500000}]
[{"$f":"'Org structure'!A6","v":"Vote 05 - Community Services"},null,{"$f":"'C3C'!C36","v":101235153.41999999},{"$f":"'C3C'!D36","v":94546694},{"$f":"'C3C'!E36","v":104315494},{"$f":"'C3C'!F36","v":1800602.2200000002},{"$f":"'C3C'!G36","v":75885920.609999999},{"$f":"'C3C'!H36","v":60036595},15849325.609999999,0.26399441224140041,{"$f":"'C3C'!K36","v":104315494}]
[{"$f":"'Org structure'!A7","v":"Vote 06 - Planning & Development"},null,{"$f":"'C3C'!C51","v":133969.78},{"$f":"'C3C'!D51","v":100000},{"$f":"'C3C'!E51","v":100000},{"$f":"'C3C'!F51","v":1043.48},{"$f":"'C3C'!G51","v":44598.94},{"$f":"'C3C'!H51","v":58331},-13732.059999999998,-0.23541615950352296,{"$f":"'C3C'!K51","v":100000}]
[{"$f":"'Org structure'!A8","v":"Vote 07 - Infrastructure & Technical Services"},null,{"$f":"'C3C'!C62","v":411929707.13999999},{"$f":"'C3C'!D62","v":475491026},{"$f":"'C3C'!E62","v":507856381},{"$f":"'C3C'!F62","v":18287109.809999999},{"$f":"'C3C'!G62","v":130078160.53},{"$f":"'C3C'!H62","v":293552392.5},-163474231.97,-0.55688264223566153,{"$f":"'C3C'!K62","v":507856381}]
[{"$f":"'Org structure'!A9","v":"Vote 08 - "},null,{"$f":"'C3C'!C82","v":0},{"$f":"'C3C'!D82","v":0},{"$f":"'C3C'!E82","v":0},{"$f":"'C3C'!F82","v":0},{"$f":"'C3C'!G82","v":0},{"$f":"'C3C'!H82","v":0},{"$f":"G13-H13","v":0},{"$f":"IF(I13=0,\"\",I13/H13)","v":""},{"$f":"'C3C'!K82","v":0}]
[{"$f":"'Org structure'!A10","v":"Vote 09 - "},null,{"$f":"'C3C'!C83","v":0},{"$f":"'C3C'!D83","v":0},{"$f":"'C3C'!E83","v":0},{"$f":"'C3C'!F83","v":0},{"$f":"'C3C'!G83","v":0},{"$f":"'C3C'!H83","v":0},0,"",{"$f":"'C3C'!K83","v":0}]
[{"$f":"'Org structure'!A11","v":"Vote 10 - "},null,{"$f":"'C3C'!C84","v":0},{"$f":"'C3C'!D84","v":0},{"$f":"'C3C'!E84","v":0},{"$f":"'C3C'!F84","v":0},{"$f":"'C3C'!G84","v":0},{"$f":"'C3C'!H84","v":0},0,"",{"$f":"'C3C'!K84","v":0}]
[{"$f":"'Org structure'!A12","v":"Vote 11 - "},null,{"$f":"'C3C'!C85","v":0},{"$f":"'C3C'!D85","v":0},{"$f":"'C3C'!E85","v":0},{"$f":"'C3C'!F85","v":0},{"$f":"'C3C'!G85","v":0},{"$f":"'C3C'!H85","v":0},0,"",{"$f":"'C3C'!K85","v":0}]
[{"$f":"'Org structure'!A13","v":"Vote 12 - "},null,{"$f":"'C3C'!C86","v":0},{"$f":"'C3C'!D86","v":0},{"$f":"'C3C'!E86","v":0},{"$f":"'C3C'!F86","v":0},{"$f":"'C3C'!G86","v":0},{"$f":"'C3C'!H86","v":0},0,"",{"$f":"'C3C'!K86","v":0}]
[{"$f":"'Org structure'!A14","v":"Vote 13 - "},null,{"$f":"'C3C'!C87","v":0},{"$f":"'C3C'!D87","v":0},{"$f":"'C3C'!E87","v":0},{"$f":"'C3C'!F87","v":0},{"$f":"'C3C'!G87","v":0},{"$f":"'C3C'!H87","v":0},0,"",{"$f":"'C3C'!K87","v":0}]
[{"$f":"'Org structure'!A15","v":"Vote 14 - "},null,{"$f":"'C3C'!C88","v":0},{"$f":"'C3C'!D88","v":0},{"$f":"'C3C'!E88","v":0},{"$f":"'C3C'!F88","v":0},{"$f":"'C3C'!G88","v":0},{"$f":"'C3C'!H88","v":0},0,"",{"$f":"'C3C'!K88","v":0}]
[{"$f":"'Org structure'!A16","v":"Vote 15 - Other"},null,{"$f":"'C3C'!C89","v":0},{"$f":"'C3C'!D89","v":0},{"$f":"'C3C'!E89","v":0},{"$f":"'C3C'!F89","v":0},{"$f":"'C3C'!G89","v":0},{"$f":"'C3C'!H89","v":0},0,"",{"$f":"'C3C'!K89","v":0}]
["Total Revenue by Vote",2,{"$f":"SUM(C6:C20)","v":995526954.07999992},{"$f":"SUM(D6:D20)","v":1078275845},1160920845,37947012.559999995,659184994.98000002,670316558,-11131563.019999951,-1.66064270487556E-2,{"$f":"SUM(K6:K20)","v":1160920845}]
[]
["Expenditure by Vote",1]
[{"$f":"'Org structure'!A2","v":"Vote 01 - Municipal Council"},null,{"$f":"'C3C'!C93","v":69361549.310000002},{"$f":"'C3C'!D93","v":60486020},{"$f":"'C3C'!E93","v":69322020},{"$f":"'C3C'!F93","v":4654306.71},{"$f":"'C3C'!G93","v":37634512.840000004},{"$f":"'C3C'!H93","v":39701696},{"$f":"G24-H24","v":-2067183.1599999964},{"$f":"IF(I24=0,\"\",I24/H24)","v":-5.2067880425057819E-2},{"$f":"'C3C'!K93","v":69322020}]
[{"$f":"'Org structure'!A3","v":"Vote 02 - Office Of The Accounting Officer"},null,{"$f":"'C3C'!C99","v":21666626.509999998},{"$f":"'C3C'!D99","v":22678311},{"$f":"'C3C'!E99","v":24508311},{"$f":"'C3C'!F99","v":1136616.01},{"$f":"'C3C'!G99","v":9310757.2699999996},{"$f":"'C3C'!H99","v":14144202},-4833444.7300000004,-0.34172622322560159,{"$f":"'C3C'!K99","v":24508311}]
[{"$f":"'Org structure'!A4","v":"Vote 03 - Budget And Treasury Office"},null,{"$f":"'C3C'!C106","v":111788095.32000001},{"$f":"'C3C'!D106","v":140405027},{"$f":"'C3C'!E106","v":142718895},{"$f":"'C3C'!F106","v":48710618.420000002},{"$f":"'C3C'!G106","v":88294885.829999998},{"$f":"'C3C'!H106","v":83060028},5234857.8299999982,6.3024994766435652E-2,{"$f":"'C3C'!K106","v":142718895}]
[{"$f":"'Org structure'!A5","v":"Vote 04 - Corporate Services"},null,{"$f":"'C3C'!C114","v":114403634.65000001},{"$f":"'C3C'!D114","v":82262312},{"$f":"'C3C'!E114","v":91013312},{"$f":"'C3C'!F114","v":7603663.3700000001},{"$f":"'C3C'!G114","v":40937750.469999999},{"$f":"'C3C'!H114","v":52361991},-11424240.530000001,-0.21817811568700665,{"$f":"'C3C'!K114","v":91013312}]
[{"$f":"'Org structure'!A6","v":"Vote 05 - Community Services"},null,{"$f":"'C3C'!C123","v":170571230.02000001},{"$f":"'C3C'!D123","v":148339408},{"$f":"'C3C'!E123","v":158268208},{"$f":"'C3C'!F123","v":24521525.280000001},{"$f":"'C3C'!G123","v":82797587.210000008},{"$f":"'C3C'!H123","v":91496048},-8698460.7899999917,-9.5069251406355734E-2,{"$f":"'C3C'!K123","v":158268208}]
[{"$f":"'Org structure'!A7","v":"Vote 06 - Planning & Development"},null,{"$f":"'C3C'!C138","v":17223219.059999999},{"$f":"'C3C'!D138","v":24919438},{"$f":"'C3C'!E138","v":24919438},{"$f":"'C3C'!F138","v":1568949.2599999998},{"$f":"'C3C'!G138","v":11326433.779999999},{"$f":"'C3C'!H138","v":14536494},-3210060.2200000007,-0.22082767825584357,{"$f":"'C3C'!K138","v":24919438}]
[{"$f":"'Org structure'!A8","v":"Vote 07 - Infrastructure & Technical Services"},null,{"$f":"'C3C'!C149","v":501141267.70999998},{"$f":"'C3C'!D149","v":375886746},{"$f":"'C3C'!E149","v":406317563},{"$f":"'C3C'!F149","v":141960428.65000001},{"$f":"'C3C'!G149","v":244737360.47000003},{"$f":"'C3C'!H149","v":234482939.5},10254420.970000029,4.3732055696103334E-2,{"$f":"'C3C'!K149","v":406317563}]
[{"$f":"'Org structure'!A9","v":"Vote 08 - "},null,{"$f":"'C3C'!C169","v":0},{"$f":"'C3C'!D169","v":0},{"$f":"'C3C'!E169","v":0},{"$f":"'C3C'!F169","v":0},{"$f":"'C3C'!G169","v":0},{"$f":"'C3C'!H169","v":0},{"$f":"G31-H31","v":0},{"$f":"IF(I31=0,\"\",I31/H31)","v":""},{"$f":"'C3C'!K169","v":0}]
[{"$f":"'Org structure'!A10","v":"Vote 09 - "},null,{"$f":"'C3C'!C170","v":0},{"$f":"'C3C'!D170","v":0},{"$f":"'C3C'!E170","v":0},{"$f":"'C3C'!F170","v":0},{"$f":"'C3C'!G170","v":0},{"$f":"'C3C'!H170","v":0},0,"",{"$f":"'C3C'!K170","v":0}]
[{"$f":"'Org structure'!A11","v":"Vote 10 - "},null,{"$f":"'C3C'!C171","v":0},{"$f":"'C3C'!D171","v":0},{"$f":"'C3C'!E171","v":0},{"$f":"'C3C'!F171","v":0},{"$f":"'C3C'!G171","v":0},{"$f":"'C3C'!H171","v":0},0,{"$f":"IF(I33=0,\"\",I33/H33)","v":""},{"$f":"'C3C'!K171","v":0}]
[{"$f":"'Org structure'!A12","v":"Vote 11 - "},null,{"$f":"'C3C'!C172","v":0},{"$f":"'C3C'!D172","v":0},{"$f":"'C3C'!E172","v":0},{"$f":"'C3C'!F172","v":0},{"$f":"'C3C'!G172","v":0},{"$f":"'C3C'!H172","v":0},0,{"$f":"IF(I34=0,\"\",I34/H34)","v":""},{"$f":"'C3C'!K172","v":0}]
[{"$f":"'Org structure'!A13","v":"Vote 12 - "},null,{"$f":"'C3C'!C173","v":0},{"$f":"'C3C'!D173","v":0},{"$f":"'C3C'!E173","v":0},{"$f":"'C3C'!F173","v":0},{"$f":"'C3C'!G173","v":0},{"$f":"'C3C'!H173","v":0},0,{"$f":"IF(I35=0,\"\",I35/H35)","v":""},{"$f":"'C3C'!K173","v":0}]
[{"$f":"'Org structure'!A14","v":"Vote 13 - "},null,{"$f":"'C3C'!C174","v":0},{"$f":"'C3C'!D174","v":0},{"$f":"'C3C'!E174","v":0},{"$f":"'C3C'!F174","v":0},{"$f":"'C3C'!G174","v":0},{"$f":"'C3C'!H174","v":0},0,{"$f":"IF(I36=0,\"\",I36/H36)","v":""},{"$f":"'C3C'!K174","v":0}]
[{"$f":"'Org structure'!A15","v":"Vote 14 - "},null,{"$f":"'C3C'!C175","v":0},{"$f":"'C3C'!D175","v":0},{"$f":"'C3C'!E175","v":0},{"$f":"'C3C'!F175","v":0},{"$f":"'C3C'!G175","v":0},{"$f":"'C3C'!H175","v":0},0,{"$f":"IF(I37=0,\"\",I37/H37)","v":""},{"$f":"'C3C'!K175","v":0}]
[{"$f":"'Org structure'!A16","v":"Vote 15 - Other"},null,{"$f":"'C3C'!C176","v":0},{"$f":"'C3C'!D176","v":0},{"$f":"'C3C'!E176","v":0},{"$f":"'C3C'!F176","v":0},{"$f":"'C3C'!G176","v":0},{"$f":"'C3C'!H176","v":0},0,"",{"$f":"'C3C'!K176","v":0}]
["Total Expenditure by Vote",2,{"$f":"SUM(C24:C38)","v":1006155622.5799999},{"$f":"SUM(D24:D38)","v":854977262},917067747,230156107.69999999,515039287.87,529783398.5,-14744110.629999965,{"$f":"IF(I39=0,\"\",I39/H39)","v":-2.783045046663531E-2},{"$f":"SUM(K24:K38)","v":917067747}]
[{"$f":"result","v":"Surplus/ (Deficit) for the year"},2,{"$f":"C21-C39","v":-10628668.5},223298583,243853098,-192209095.13999999,144145707.11000001,140533159.5,{"$f":"I21-I39","v":3612547.6100000143},{"$f":"IF(I40=0,\"\",I40/H40)","v":2.5706015739296137E-2},{"$f":"K21-K39","v":243853098}]
[{"$f":"head27a","v":"References"}]
["1. Insert 'Vote'; e.g. Department, if different to standard classification structure"]
["2. Must reconcile to Monthly Budget Statement - Financial Performance Statement (standard classification)"]

{"sheet":"C3C","index":10,"n_rows":186,"n_cols":23,"rows_kept":186,"cut":false,"hidden":false,"merged":[[1,11,1,22],[1,3,1,10]]}
[{"$f":"muni& \" - \"&S71C& \" - \"&\"A\"& \" - \"&date","v":"NW375 Moses Kotane - Table C3 Monthly Budget Statement - Financial Performance (revenue and expenditure by municipal vote) - A - M07 January"}]
[{"$f":"Vdesc","v":"Vote Description"},{"$f":"head27","v":"Ref"},{"$f":"Head1","v":"2019/20"},{"$f":"Head2","v":"Budget Year 2020/21"},null,null,null,null,null,null,null,{"$f":"Head4","v":{"$error":"#REF!"}}]
["R thousand",null,{"$f":"Head5","v":"Audited Outcome"},{"$f":"Head6","v":"Original Budget"},{"$f":"Head7","v":"Adjusted Budget"},{"$f":"Head38","v":"Monthly actual"},{"$f":"Head39","v":"YearTD actual"},{"$f":"Head40","v":"YearTD budget"},{"$f":"Head41","v":"YTD variance"},{"$f":"Head41","v":"YTD variance"},{"$f":"Head8","v":"Full Year Forecast"},{"$f":"Head12","v":"Forecast 2010/11"},{"$f":"Head13","v":"Forecast 2011/12"},{"$f":"Head14","v":"Forecast 2012/13"},{"$f":"Head15","v":"Forecast 2013/14"},{"$f":"Head16","v":"Forecast 2014/15"},{"$f":"Head17","v":"Forecast 2015/16"},{"$f":"Head18","v":"Forecast 2016/17"},{"$f":"Head19","v":"Forecast 2017/18"},{"$f":"Head20","v":"Forecast 2018/19"},{"$f":"Head21","v":"Forecast 2019/20"},{"$f":"Head22","v":"Forecast 2020/21"},{"$f":"Head23","v":"Forecast 2021/22"}]
[null,null,null,null,null,null,null,null,null,"%"]
["Revenue by Vote",1]
[{"$f":"'Org structure'!A2","v":"Vote 01 - Municipal Council"},null,{"$f":"SUM(C7:C11)","v":1559133.26},1827000,1827000,0,1096370.07,1065743,{"$f":"G6-H6","v":30627.070000000065},{"$f":"IF(I6=0,\"\",I6/H6)","v":2.873776323184864E-2},{"$f":"SUM(K7:K11)","v":1827000}]
[{"$f":"'Org structure'!E3","v":"01.1 - Office Of The Mayor"},null,1559133.26,1827000,1827000,0,1096370.07,1065750,{"$f":"G7-H7","v":30620.070000000065},{"$f":"IF(I7=0,\"\",I7/H7)","v":2.8731006333567972E-2},1827000]
[{"$f":"'Org structure'!E4","v":"01.2 - Office Of The Speaker"},null,0,0,0,0,0,0,{"$f":"G8-H8","v":0},{"$f":"IF(I8=0,\"\",I8/H8)","v":""},0]
[{"$f":"'Org structure'!E5","v":"01.3 - Office Of The Chief Whip"},null,0,0,0,0,0,0,{"$f":"G9-H9","v":0},{"$f":"IF(I9=0,\"\",I9/H9)","v":""},0]
[{"$f":"'Org structure'!E6","v":"01.4 - Mpac"},null,0,0,0,0,0,0,{"$f":"G10-H10","v":0},{"$f":"IF(I10=0,\"\",I10/H10)","v":""},0]
[{"$f":"'Org structure'!E7","v":"01.5 - Council General Administration"},null,0,0,0,0,0,-7,{"$f":"G11-H11","v":7},{"$f":"IF(I11=0,\"\",I11/H11)","v":-1},0]
[{"$f":"'Org structure'!A3","v":"Vote 02 - Office Of The Accounting Officer"},null,{"$f":"SUM(C13:C18)","v":0},0,0,0,0,0,0,"",{"$f":"SUM(K13:K18)","v":0}]
[{"$f":"'Org structure'!E9","v":"02.1 - Office Of The Ao Admin"},null,0,0,0,0,0,0,{"$f":"G13-H13","v":0},{"$f":"IF(I13=0,\"\",I13/H13)","v":""},0]
[{"$f":"'Org structure'!E10","v":"02.2 - Strategic Planning Monitoring & Evaluat"},null,0,0,0,0,0,0,0,"",0]
[{"$f":"'Org structure'!E11","v":"02.3 - Perfomance Management System"},null,0,0,0,0,0,0,0,"",0]
[{"$f":"'Org structure'!E12","v":"02.4 - Internal Audit"},null,0,0,0,0,0,0,0,"",0]
[{"$f":"'Org structure'!E13","v":"02.5 - Municipal Planning Idp"},null,0,0,0,0,0,0,0,"",0]
[{"$f":"'Org structure'!E14","v":"02.6 - Risk"},null,0,0,0,0,0,0,0,"",0]
[{"$f":"'Org structure'!A4","v":"Vote 03 - Budget And Treasury Office"},null,{"$f":"SUM(C20:C26)","v":480028747.55999994},505811125,546321970,17858257.049999997,452079944.83000004,315311834.5,136768110.33000004,0.43375508105135852,{"$f":"SUM(K20:K26)","v":546321970}]
[{"$f":"'Org structure'!E16","v":"03.1 - Chief Financial Officer Admin"},null,142550211.72,148602075,148602075,12099935.619999999,84208675.900000006,86684500,{"$f":"G20-H20","v":-2475824.099999994},{"$f":"IF(I20=0,\"\",I20/H20)","v":-2.8561324112153775E-2},148602075]
[{"$f":"'Org structure'!E17","v":"03.2 - Budget Expenditure & Reporting"},null,0,0,0,0,0,0,0,"",0]
[{"$f":"'Org structure'!E18","v":"03.3 - Budget Expenditure & Reporting"},null,0,0,0,0,0,0,0,"",0]
[{"$f":"'Org structure'!E19","v":"03.4 - Revenue Management"},null,337478535.83999997,357209050,397719895,5758321.4299999997,367871268.93000001,228627334.5,139243934.43000001,0.60904324819480415,397719895]
[{"$f":"'Org structure'!E20","v":"03.5 - Supply Chain Management"},null,0,0,0,0,0,0,0,"",0]
[{"$f":"'Org structure'!E21","v":"03.6 - Assets Management"},null,0,0,0,0,0,0,0,"",0]
[{"$f":"'Org structure'!E22","v":"03.7 - Expenditure"},null,0,0,0,0,0,0,0,"",0]
[{"$f":"'Org structure'!A5","v":"Vote 04 - Corporate Services"},null,{"$f":"SUM(C28:C35)","v":640242.92000000004},500000,500000,0,0,291662,-291662,-1,{"$f":"SUM(K28:K35)","v":500000}]
[{"$f":"'Org structure'!E24","v":"04.1 - Legal Services"},null,0,0,0,0,0,0,{"$f":"G28-H28","v":0},{"$f":"IF(I28=0,\"\",I28/H28)","v":""},0]
[{"$f":"'Org structure'!E25","v":"04.2 - Corporate Service Administration"},null,0,0,0,0,0,0,0,"",0]
[{"$f":"'Org structure'!E26","v":"04.3 - Human Resources"},null,640242.92000000004,500000,500000,0,0,291662,-291662,-1,500000]
[{"$f":"'Org structure'!E27","v":"04.4 - Media & Communication"},null,0,0,0,0,0,0,0,"",0]
[{"$f":"'Org structure'!E28","v":"04.5 - Organisational Development"},null,0,0,0,0,0,0,0,"",0]
[{"$f":"'Org structure'!E29","v":"04.6 - Labour Relations"},null,0,0,0,0,0,0,0,"",0]
[{"$f":"'Org structure'!E30","v":"04.7 - Legal Services"},null,0,0,0,0,0,0,0,"",0]
[{"$f":"'Org structure'!E31","v":"04.8 - Information Technology Services"},null,0,0,0,0,0,0,0,"",0]
[{"$f":"'Org structure'!A6","v":"Vote 05 - Community Services"},null,{"$f":"SUM(C37:C50)","v":101235153.41999999},94546694,104315494,1800602.2200000002,75885920.609999999,60036595,15849325.609999999,0.26399441224140041,{"$f":"SUM(K37:K50)","v":104315494}]
[{"$f":"'Org structure'!E33","v":"05.1 - Municipal Buildings"},null,29638422.809999999,7223512,7223512,0,0,4213713,{"$f":"G37-H37","v":-4213713},{"$f":"IF(I37=0,\"\",I37/H37)","v":-1},7223512]
[{"$f":"'Org structure'!E34","v":"05.2 - Fleet Management"},null,290000,0,0,0,0,0,0,"",0]
[{"$f":"'Org structure'!E35","v":"05.3 - Community Services Administration"},null,0,0,0,0,0,0,0,"",0]
[{"$f":"'Org structure'!E36","v":"05.4 - Cemeteries"},null,11727.79,10000,10000,4956.55,8021.77,5831,2190.7700000000004,0.37571085577087987,10000]
[{"$f":"'Org structure'!E37","v":"05.5 - Disaster Management"},null,0,0,0,0,0,0,0,"",0]
[{"$f":"'Org structure'!E38","v":"05.6 - Fires Service"},null,0,0,0,0,0,0,0,"",0]
[{"$f":"'Org structure'!E39","v":"05.7 - Libraries"},null,671391.64,40000,40000,0,7217.39,23331,-16113.61,-0.69065235094938071,40000]
[{"$f":"'Org structure'!E40","v":"05.8 - Municipal Buildings"},null,0,0,0,0,0,0,0,"",0]
[{"$f":"'Org structure'!E41","v":"05.9 - Sports Recreation & Social Amenitie"},null,5859.31,9898475,9898475,0,0,5774097,-5774097,-1,9898475]
[{"$f":"'Org structure'!E42","v":"05.10 - Waste Management Solid Waste"},null,65004341.869999997,74324707,84093507,909045.67,74984081.450000003,48240461,26743620.450000003,0.55438152736558644,84093507]
[{"$f":"'Org structure'!E43","v":"05.11 - Safety And Security"},null,0,0,0,0,0,0,0,"",0]
[{"$f":"'Org structure'!E44","v":"05.12 - Traffic Service"},null,0,0,0,0,0,0,0,"",0]
[{"$f":"'Org structure'!E45","v":"05.13 - Traffic Service"},null,5613410,3050000,3050000,886600,886600,1779162,-892562,-0.50167550790765536,3050000]
[{"$f":"'Org structure'!E46","v":"05.14 - Fleet Management"},null,0,0,0,0,0,0,0,"",0]
[{"$f":"'Org structure'!A7","v":"Vote 06 - Planning & Development"},null,{"$f":"SUM(C52:C61)","v":133969.78},100000,100000,1043.48,44598.94,58331,-13732.059999999998,-0.23541615950352296,{"$f":"SUM(K52:K61)","v":100000}]
[{"$f":"'Org structure'!E48","v":"06.1 - Planning And Development Admin"},null,0,0,0,0,0,0,{"$f":"G52-H52","v":0},{"$f":"IF(I52=0,\"\",I52/H52)","v":""},0]
[{"$f":"'Org structure'!E49","v":"06.2 - Municipal Planning Idp"},null,0,0,0,0,0,0,0,"",0]
[{"$f":"'Org structure'!E50","v":"06.3 - Pms"},null,0,0,0,0,0,0,0,"",0]
[{"$f":"'Org structure'!E51","v":"06.4 - Town Planning"},null,133969.78,100000,100000,1043.48,44598.94,58331,-13732.059999999998,-0.23541615950352296,100000]
[{"$f":"'Org structure'!E52","v":"06.5 - Land Use And Housing Admin"},null,0,0,0,0,0,0,0,"",0]
[{"$f":"'Org structure'!E53","v":"06.6 - Local Economic Development"},null,0,0,0,0,0,0,0,"",0]
[{"$f":"'Org structure'!E54","v":"06.7 - Led"},null,0,0,0,0,0,0,0,"",0]
[{"$f":"'Org structure'!E55","v":"06.8 - Agriculture & Rural Development"},null,0,0,0,0,0,0,0,"",0]
[{"$f":"'Org structure'!E56","v":"06.9 - Tourism & Business Development"},null,0,0,0,0,0,0,0,"",0]
[{"$f":"'Org structure'!E57","v":"06.10 - Arts & Culture"},null,0,0,0,0,0,0,0,"",0]
[{"$f":"'Org structure'!A8","v":"Vote 07 - Infrastructure & Technical Services"},null,{"$f":"SUM(C63:C81)","v":411929707.13999999},475491026,507856381,18287109.809999999,130078160.53,293552392.5,{"$f":"G62-H62","v":-163474231.97},{"$f":"IF(I62=0,\"\",I62/H62)","v":-0.55688264223566153},{"$f":"SUM(K63:K81)","v":507856381}]
[{"$f":"'Org structure'!E59","v":"07.1 - Infrastructure Admin & Tech Admin"},null,0,0,0,0,0,0,{"$f":"G63-H63","v":0},{"$f":"IF(I63=0,\"\",I63/H63)","v":""},0]
[{"$f":"'Org structure'!E60","v":"07.2 - Fleet Management"},null,0,0,0,0,0,0,0,"",0]
[{"$f":"'Org structure'!E61","v":"07.3 - Roads"},null,51989682.009999998,60981782,60981782,0,0,35572705,-35572705,-1,60981782]
[{"$f":"'Org structure'!E62","v":"07.4 - Storm Water"},null,0,0,0,0,0,0,0,"",0]
[{"$f":"'Org structure'!E63","v":"07.5 - Street Lighting"},null,15484099.17,12265741,12265741,0,0,7155015,-7155015,-1,12265741]
[{"$f":"'Org structure'!E64","v":"07.6 - Project Management Unit"},null,3342534.91,4178767,4178767,0,0,2437610,-2437610,-1,4178767]
[{"$f":"'Org structure'!E65","v":"07.7 - Sanitation Treatment Plant: Mogwase"},null,0,0,0,0,0,0,0,"",0]
[{"$f":"'Org structure'!E66","v":"07.8 - Sanitation Treatment Plant: Madikwe"},null,0,0,0,0,0,0,0,"",0]
[{"$f":"'Org structure'!E67","v":"07.9 - Sanitation Reticulation"},null,28295147.57,47377755,47377755,301653.21999999997,20827939.27,27637008,-6809068.7300000004,-0.24637503198609634,47377755]
[{"$f":"'Org structure'!E68","v":"07.10 - Water Administration"},null,224818243.47999999,254799981,254799981,17985456.59,96234866.260000005,148633303,-52398436.739999995,-0.35253496815582436,254799981]
[{"$f":"'Org structure'!E69","v":"07.11 - Water Madikwe: Water Treatment Work"},null,0,0,0,0,0,0,0,"",0]
[{"$f":"'Org structure'!E70","v":"07.12 - Water: Pella Water Treatment Works"},null,0,0,0,0,0,0,0,"",0]
[{"$f":"'Org structure'!E71","v":"07.13 - Water: Madikwe Retail & Bulk Lines"},null,0,0,0,0,0,0,0,"",0]
[{"$f":"'Org structure'!E72","v":"07.14 - Water: Madikwe Rural"},null,0,0,0,0,0,0,0,"",0]
[{"$f":"'Org structure'!E73","v":"07.15 - Water: Molatedi"},null,0,0,0,0,0,0,0,"",0]
[{"$f":"'Org structure'!E74","v":"07.16 - Water Eastern: Retail Mankwe"},null,0,0,0,0,0,0,0,"",0]
[{"$f":"'Org structure'!E75","v":"07.17 - Water Vaalkopdam: Mankwe"},null,0,0,0,0,0,0,0,"",0]
[{"$f":"'Org structure'!E76","v":"07.18 - Water Eastern: Retail Mankwe"},null,88000000,95887000,128252355,0,13015355,72116751.5,-59101396.5,-0.81952383143602914,128252355]
[{"$f":"'Org structure'!E77","v":"07.19 - Reporting Function Electricity"},null,0,0,0,0,0,0,0,"",0]
[{"$f":"'Org structure'!A9","v":"Vote 08 - "},null,0,0,0,0,0,0,0,"",0]
[{"$f":"'Org structure'!A10","v":"Vote 09 - "},null,0,0,0,0,0,0,0,"",0]
[{"$f":"'Org structure'!A11","v":"Vote 10 - "},null,0,0,0,0,0,0,0,"",0]
[{"$f":"'Org structure'!A12","v":"Vote 11 - "},null,0,0,0,0,0,0,0,"",0]
[{"$f":"'Org structure'!A13","v":"Vote 12 - "},null,0,0,0,0,0,0,0,"",0]
[{"$f":"'Org structure'!A14","v":"Vote 13 - "},null,0,0,0,0,0,0,{"$f":"G87-H87","v":0},{"$f":"IF(I87=0,\"\",I87/H87)","v":""},0]
[{"$f":"'Org structure'!A15","v":"Vote 14 - "},null,0,0,0,0,0,0,0,"",0]
[{"$f":"'Org structure'!A16","v":"Vote 15 - Other"},null,0,0,0,0,0,0,0,"",0]
["Total Revenue by Vote",2,{"$f":"C6+C12+C19+C27+C36+C51+C62+C82+C83+C84+C85+C86+C87+C88+C89","v":995526954.07999992},1078275845,1160920845,37947012.559999995,659184994.98000002,670316558,-11131563.019999981,-1.6606427048755642E-2,{"$f":"K6+K12+K19+K27+K36+K51+K62+K82+K83+K84+K85+K86+K87+K88+K89","v":1160920845}]
[null,null,null,null,null,null,null,null,0,""]
["Expenditure by Vote",1,null,null,null,null,null,null,0,""]
[{"$f":"'Org structure'!A2","v":"Vote 01 - Municipal Council"},null,{"$f":"SUM(C94:C98)","v":69361549.310000002},60486020,69322020,4654306.71,37634512.840000004,39701696,-2067183.1599999964,-5.2067880425057819E-2,{"$f":"SUM(K94:K98)","v":69322020}]
[{"$f":"'Org structure'!E3","v":"01.1 - Office Of The Mayor"},null,7755490.1299999999,7468021,9406021,558374.79,4509034.79,5325394,{"$f":"G94-H94","v":-816359.21},{"$f":"IF(I94=0,\"\",I94/H94)","v":-0.15329555146530002},9406021]
[{"$f":"'Org structure'!E4","v":"01.2 - Office Of The Speaker"},null,6088184.2000000002,6501849,6701849,652780.31999999995,4732681.9400000004,3892789,{"$f":"G95-H95","v":839892.94000000041},{"$f":"IF(I95=0,\"\",I95/H95)","v":0.21575609158369499},6701849]
[{"$f":"'Org structure'!E5","v":"01.3 - Office Of The Chief Whip"},null,1587093.48,3311676,3361676,140959.64000000001,985007.48,1956832,{"$f":"G96-H96","v":-971824.52},{"$f":"IF(I96=0,\"\",I96/H96)","v":-0.49663155549377769},3361676]
[{"$f":"'Org structure'!E6","v":"01.4 - Mpac"},null,199140,448000,538000,0,0,306338,{"$f":"G97-H97","v":-306338},{"$f":"IF(I97=0,\"\",I97/H97)","v":-1},538000]
[{"$f":"'Org structure'!E7","v":"01.5 - Council General Administration"},null,53731641.5,42756474,49314474,3302191.96,27407788.629999999,28220343,{"$f":"G98-H98","v":-812554.37000000104},{"$f":"IF(I98=0,\"\",I98/H98)","v":-2.8793213817422454E-2},49314474]
[{"$f":"'Org structure'!A3","v":"Vote 02 - Office Of The Accounting Officer"},null,{"$f":"SUM(C100:C105)","v":21666626.509999998},22678311,24508311,1136616.01,9310757.2699999996,14144202,-4833444.7300000004,-0.34172622322560159,{"$f":"SUM(K100:K105)","v":24508311}]
[{"$f":"'Org structure'!E9","v":"02.1 - Office Of The Ao Admin"},null,13399133.619999999,12187364,13927364,615391.25,5591567.5999999996,7979368,{"$f":"G100-H100","v":-2387800.4000000004},{"$f":"IF(I100=0,\"\",I100/H100)","v":-0.29924680751658533},13927364]
[{"$f":"'Org structure'!E10","v":"02.2 - Strategic Planning Monitoring & Evaluat"},null,0,0,0,0,0,0,0,"",0]
[{"$f":"'Org structure'!E11","v":"02.3 - Perfomance Management System"},null,4718746.83,2373838,2373838,207034.82,1515060.38,1384775,130285.37999999989,9.4084150854831933E-2,2373838]
[{"$f":"'Org structure'!E12","v":"02.4 - Internal Audit"},null,3548746.06,4025368,4115368,314189.94,2204129.29,2393164,-189034.70999999996,-7.8989450785654461E-2,4115368]
[{"$f":"'Org structure'!E13","v":"02.5 - Municipal Planning Idp"},null,0,3149853,3149853,0,0,1837444,-1837444,-1,3149853]
[{"$f":"'Org structure'!E14","v":"02.6 - Risk"},null,0,941888,941888,0,0,549451,-549451,-1,941888]
[{"$f":"'Org structure'!A4","v":"Vote 03 - Budget And Treasury Office"},null,{"$f":"SUM(C107:C113)","v":111788095.32000001},140405027,142718895,48710618.420000002,88294885.829999998,83060028,5234857.8299999982,6.3024994766435652E-2,{"$f":"SUM(K107:K113)","v":142718895}]
[{"$f":"'Org structure'!E16","v":"03.1 - Chief Financial Officer Admin"},null,23513926.940000001,6863583,10523583,1210789.2,19338970.850000001,5833804,{"$f":"G107-H107","v":13505166.850000001},{"$f":"IF(I107=0,\"\",I107/H107)","v":2.3149846738080337},10523583]
[{"$f":"'Org structure'!E17","v":"03.2 - Budget Expenditure & Reporting"},null,0,0,0,0,0,0,0,"",0]
[{"$f":"'Org structure'!E18","v":"03.3 - Budget Expenditure & Reporting"},null,4951789.32,8403932,8403932,433031.7,3216480.73,4902324,-1685843.27,-0.34388654646245331,8403932]
[{"$f":"'Org structure'!E19","v":"03.4 - Revenue Management"},null,72458854.260000005,105647963,104301831,46128291.770000003,58243590.759999998,60954955,-2711364.2400000021,-4.4481441090392114E-2,104301831]
[{"$f":"'Org structure'!E20","v":"03.5 - Supply Chain Management"},null,7794166.3600000003,7901614,7901614,653019.16,4385767.33,4609297,-223529.66999999993,-4.8495393115262464E-2,7901614]
[{"$f":"'Org structure'!E21","v":"03.6 - Assets Management"},null,3069358.44,11587935,11587935,285486.59000000003,3110076.16,6759648,-3649571.84,-0.53990560455218972,11587935]
[{"$f":"'Org structure'!E22","v":"03.7 - Expenditure"},null,0,0,0,0,0,0,0,"",0]
[{"$f":"'Org structure'!A5","v":"Vote 04 - Corporate Services"},null,{"$f":"SUM(C115:C122)","v":114403634.65000001},82262312,91013312,7603663.3700000001,40937750.469999999,52361991,{"$f":"G114-H114","v":-11424240.530000001},{"$f":"IF(I114=0,\"\",I114/H114)","v":-0.21817811568700665},{"$f":"SUM(K115:K122)","v":91013312}]
[{"$f":"'Org structure'!E24","v":"04.1 - Legal Services"},null,1161607.3,1309413,1309413,103603.25,750249.07,763833,{"$f":"G115-H115","v":-13583.930000000051},{"$f":"IF(I115=0,\"\",I115/H115)","v":-1.7783900407549885E-2},1309413]
[{"$f":"'Org structure'!E25","v":"04.2 - Corporate Service Administration"},null,36611699.579999998,37853775,41157775,2719911.23,23679499.120000001,23733437,-53937.879999998957,-2.2726535562463605E-3,41157775]
[{"$f":"'Org structure'!E26","v":"04.3 - Human Resources"},null,11312659.960000001,15769578,18216578,746176.21,6567948.3600000003,10422459,-3854510.6399999997,-0.36982737375124236,18216578]
[{"$f":"'Org structure'!E27","v":"04.4 - Media & Communication"},null,0,0,0,0,0,0,0,"",0]
[{"$f":"'Org structure'!E28","v":"04.5 - Organisational Development"},null,0,0,0,0,0,0,0,"",0]
[{"$f":"'Org structure'!E29","v":"04.6 - Labour Relations"},null,0,0,0,0,0,0,0,"",0]
[{"$f":"'Org structure'!E30","v":"04.7 - Legal Services"},null,0,0,0,0,0,0,0,"",0]
[{"$f":"'Org structure'!E31","v":"04.8 - Information Technology Services"},null,65317667.810000002,27329546,30329546,4033972.68,9940053.9199999999,17442262,-7502208.0800000001,-0.43011669472686515,30329546]
[{"$f":"'Org structure'!A6","v":"Vote 05 - Community Services"},null,{"$f":"SUM(C124:C137)","v":170571230.02000001},148339408,158268208,24521525.280000001,82797587.210000008,91496048,-8698460.7899999917,-9.5069251406355734E-2,{"$f":"SUM(K124:K137)","v":158268208}]
[{"$f":"'Org structure'!E33","v":"05.1 - Municipal Buildings"},null,19613207.760000002,8784996,8784996,8668485.8900000006,12137648.609999999,5124595,{"$f":"G124-H124","v":7013053.6099999994},{"$f":"IF(I124=0,\"\",I124/H124)","v":1.3685088499676559},8784996]
[{"$f":"'Org structure'!E34","v":"05.2 - Fleet Management"},null,15037335.279999999,18271527,18271527,3318053.62,9944685.4299999997,10658445,-713759.5700000003,-6.6966576268864764E-2,18271527]
[{"$f":"'Org structure'!E35","v":"05.3 - Community Services Administration"},null,3430975.96,1981674,1981674,277703.17,2040286.79,1155994,884292.79,0.76496313129652926,1981674]
[{"$f":"'Org structure'!E36","v":"05.4 - Cemeteries"},null,0,3978010,3978010,0,0,2320535,-2320535,-1,3978010]
[{"$f":"'Org structure'!E37","v":"05.5 - Disaster Management"},null,29958.9,2486022,2814822,0,86100,1614604,-1528504,-0.94667423095694048,2814822]
[{"$f":"'Org structure'!E38","v":"05.6 - Fires Service"},null,0,0,0,0,0,0,0,"",0]
[{"$f":"'Org structure'!E39","v":"05.7 - Libraries"},null,2377705.9700000002,1774148,1774148,119307.52,704657.53,1034957,-330299.46999999997,-0.31914318179402618,1774148]
[{"$f":"'Org structure'!E40","v":"05.8 - Municipal Buildings"},null,0,0,0,0,0,0,0,"",0]
[{"$f":"'Org structure'!E41","v":"05.9 - Sports Recreation & Social Amenitie"},null,43792225.280000001,39415232,39665232,5580708.4400000004,18128485.329999998,23117256,-4988770.6700000018,-0.21580289070640571,39665232]
[{"$f":"'Org structure'!E42","v":"05.10 - Waste Management Solid Waste"},null,50915900.560000002,41881163,49931163,4405704.25,23956158.68,28455721,-4499562.32,-0.15812505049511838,49931163]
[{"$f":"'Org structure'!E43","v":"05.11 - Safety And Security"},null,23287789.82,19897500,21097500,1732719.3,12276426.189999999,12206903,69523.189999999478,5.6953995620346518E-3,21097500]
[{"$f":"'Org structure'!E44","v":"05.12 - Traffic Service"},null,0,0,0,0,0,0,0,"",0]
[{"$f":"'Org structure'!E45","v":"05.13 - Traffic Service"},null,12086130.49,9869136,9969136,418843.09,3523138.65,5807038,-2283899.35,-0.39329850261010862,9969136]
[{"$f":"'Org structure'!E46","v":"05.14 - Fleet Management"},null,0,0,0,0,0,0,0,"",0]
[{"$f":"'Org structure'!A7","v":"Vote 06 - Planning & Development"},null,{"$f":"SUM(C139:C148)","v":17223219.059999999},24919438,24919438,1568949.2599999998,11326433.779999999,14536494,-3210060.2200000007,-0.22082767825584357,{"$f":"SUM(K139:K148)","v":24919438}]
[{"$f":"'Org structure'!E48","v":"06.1 - Planning And Development Admin"},null,1821248.99,2004633,2004633,-681498.7,346600.11,1169399,{"$f":"G139-H139","v":-822798.89},{"$f":"IF(I139=0,\"\",I139/H139)","v":-0.70360834069466449},2004633]
[{"$f":"'Org structure'!E49","v":"06.2 - Municipal Planning Idp"},null,0,0,0,0,0,0,0,"",0]
[{"$f":"'Org structure'!E50","v":"06.3 - Pms"},null,0,0,0,0,0,0,0,"",0]
[{"$f":"'Org structure'!E51","v":"06.4 - Town Planning"},null,2841470.73,3849336,3849336,269898.45,2059442.86,2245488,-186045.1399999999,-8.2852876523944866E-2,3849336]
[{"$f":"'Org structure'!E52","v":"06.5 - Land Use And Housing Admin"},null,5373143.5899999999,6677188,6677188,489785.9,3298923.4,3895066,-596142.60000000009,-0.15305070568765719,6677188]
[{"$f":"'Org structure'!E53","v":"06.6 - Local Economic Development"},null,7187355.75,0,0,-3856704.2,1699.6,0,1699.6,{"$error":"#DIV/0!"},0]
[{"$f":"'Org structure'!E54","v":"06.7 - Led"},null,0,4231031,4231031,853848.48,1126148.48,2468123,-1341974.52,-0.54372270749877538,4231031]
[{"$f":"'Org structure'!E55","v":"06.8 - Agriculture & Rural Development"},null,0,8157250,8157250,4493619.33,4493619.33,4758418,-264798.66999999993,-5.5648467620961407E-2,8157250]
[{"$f":"'Org structure'!E56","v":"06.9 - Tourism & Business Development"},null,0,0,0,0,0,0,0,"",0]
[{"$f":"'Org structure'!E57","v":"06.10 - Arts & Culture"},null,0,0,0,0,0,0,0,"",0]
[{"$f":"'Org structure'!A8","v":"Vote 07 - Infrastructure & Technical Services"},null,{"$f":"SUM(C150:C168)","v":501141267.70999998},375886746,406317563,141960428.65000001,244737360.47000003,234482939.5,10254420.970000029,4.3732055696103334E-2,{"$f":"SUM(K150:K168)","v":406317563}]
[{"$f":"'Org structure'!E59","v":"07.1 - Infrastructure Admin & Tech Admin"},null,1414577.74,2463847,2453847,186301.22,761460.72,1432268,{"$f":"G150-H150","v":-670807.28},{"$f":"IF(I150=0,\"\",I150/H150)","v":-0.46835318529772363},2453847]
[{"$f":"'Org structure'!E60","v":"07.2 - Fleet Management"},null,0,0,0,0,0,0,0,"",0]
[{"$f":"'Org structure'!E61","v":"07.3 - Roads"},null,68155855.480000004,61128341,61128341,31774580.760000002,37148807.960000001,35658238,1490569.9600000009,4.1801559572292972E-2,61128341]
[{"$f":"'Org structure'!E62","v":"07.4 - Storm Water"},null,0,0,0,0,0,0,0,"",0]
[{"$f":"'Org structure'!E63","v":"07.5 - Street Lighting"},null,21499416.989999998,7598588,7598588,1803594.26,4690239.41,4432547,257692.41000000015,5.8136419083655549E-2,7598588]
[{"$f":"'Org structure'!E64","v":"07.6 - Project Management Unit"},null,3198600.64,4178767,4178767,199615.84,2003945.23,2437652,-433706.77,-0.17791988766238989,4178767]
[{"$f":"'Org structure'!E65","v":"07.7 - Sanitation Treatment Plant: Mogwase"},null,15331396.41,6230194,6230194,553710.81000000006,5692489.9000000004,3634309,2058180.9000000004,0.5663197323067467,6230194]
[{"$f":"'Org structure'!E66","v":"07.8 - Sanitation Treatment Plant: Madikwe"},null,5237872.63,8369184,8369184,333234.65000000002,2879887.53,4882052,-2002164.4700000002,-0.41010715780987178,8369184]
[{"$f":"'Org structure'!E67","v":"07.9 - Sanitation Reticulation"},null,6260267.4800000004,5328993,5328993,61659799.810000002,61997376.299999997,3108588,58888788.299999997,18.943902601438339,5328993]
[{"$f":"'Org structure'!E68","v":"07.10 - Water Administration"},null,46028675.840000004,41037321,41037321,2780907.22,25657604.41,23938453,1719151.4100000001,7.1815476547294019E-2,41037321]
[{"$f":"'Org structure'!E69","v":"07.11 - Water Madikwe: Water Treatment Work"},null,1002608,1060000,300817,0,243371.78,238746.5,4625.2799999999988,1.9373184528359573E-2,300817]
[{"$f":"'Org structure'!E70","v":"07.12 - Water: Pella Water Treatment Works"},null,1289789.3899999999,300000,300000,0,130155.02,175007,-44851.979999999996,-0.25628677710034453,300000]
[{"$f":"'Org structure'!E71","v":"07.13 - Water: Madikwe Retail & Bulk Lines"},null,2171520.42,1300000,1300000,0,1601294.5,758338,842956.5,1.1115841484931521,1300000]
[{"$f":"'Org structure'!E72","v":"07.14 - Water: Madikwe Rural"},null,3310017.09,3200000,2000000,0,-30275,1266669,-1296944,-1.0239012717608151,2000000]
[{"$f":"'Org structure'!E73","v":"07.15 - Water: Molatedi"},null,266458.8,210000,210000,0,82919,122507,-39588,-0.32314888128841618,210000]
[{"$f":"'Org structure'!E74","v":"07.16 - Water Eastern: Retail Mankwe"},null,0,0,0,0,0,0,0,"",0]
[{"$f":"'Org structure'!E75","v":"07.17 - Water Vaalkopdam: Mankwe"},null,0,0,0,0,0,0,0,"",0]
[{"$f":"'Org structure'!E76","v":"07.18 - Water Eastern: Retail Mankwe"},null,301432459.22000003,225481511,237881511,41414695.329999998,86972978.810000002,137730896,-50757917.189999998,-0.3685296376057845,237881511]
[{"$f":"'Org structure'!E77","v":"07.19 - Reporting Function Electricity"},null,24541751.579999998,8000000,28000000,1253988.75,14905104.9,14666669,238435.90000000037,1.6256990595478794E-2,28000000]
[{"$f":"'Org structure'!A9","v":"Vote 08 - "},null,0,0,0,0,0,0,0,"",0]
[{"$f":"'Org structure'!A10","v":"Vote 09 - "},null,0,0,0,0,0,0,{"$f":"G170-H170","v":0},{"$f":"IF(I170=0,\"\",I170/H170)","v":""},0]
[{"$f":"'Org structure'!A11","v":"Vote 10 - "},null,0,0,0,0,0,0,0,"",0]
[{"$f":"'Org structure'!A12","v":"Vote 11 - "},null,0,0,0,0,0,0,0,"",0]
[{"$f":"'Org structure'!A13","v":"Vote 12 - "},null,0,0,0,0,0,0,0,"",0]
[{"$f":"'Org structure'!A14","v":"Vote 13 - "},null,0,0,0,0,0,0,0,"",0]
[{"$f":"'Org structure'!A15","v":"Vote 14 - "},null,0,0,0,0,0,0,0,"",0]
[{"$f":"'Org structure'!A16","v":"Vote 15 - Other"},null,0,0,0,0,0,0,{"$f":"G176-H176","v":0},{"$f":"IF(I176=0,\"\",I176/H176)","v":""},0]
["Total Expenditure by Vote",2,{"$f":"C93+C99+C106+C114+C123+C138+C149+C169+C170+C171+C172+C173+C174+C175+C176","v":1006155622.5799999},854977262,917067747,230156107.69999999,515039287.87,529783398.5,-14744110.629999995,-2.7830450466635365E-2,{"$f":"K93+K99+K106+K114+K123+K138+K149+K169+K170+K171+K172+K173+K174+K175+K176","v":917067747}]
[null,null,null,null,null,null,null,null,0,"",null,{"$f":"#REF!-#REF!","v":{"$error":"#REF!"}},{"$f":"#REF!-#REF!","v":{"$error":"#REF!"}},{"$f":"#REF!-#REF!","v":{"$error":"#REF!"}},{"$f":"#REF!-#REF!","v":{"$error":"#REF!"}},{"$f":"#REF!-#REF!","v":{"$error":"#REF!"}},{"$f":"#REF!-#REF!","v":{"$error":"#REF!"}},{"$f":"#REF!-#REF!","v":{"$error":"#REF!"}},{"$f":"#REF!-#REF!","v":{"$error":"#REF!"}},{"$f":"#REF!-#REF!","v":{"$error":"#REF!"}},{"$f":"#REF!-#REF!","v":{"$error":"#REF!"}},{"$f":"#REF!-#REF!","v":{"$error":"#REF!"}},{"$f":"#REF!-#REF!","v":{"$error":"#REF!"}}]
[{"$f":"result","v":"Surplus/ (Deficit) for the year"},2,{"$f":"C90-C177","v":-10628668.5},223298583,243853098,-192209095.13999999,144145707.11000001,140533159.5,3612547.6100000143,2.5706015739296137E-2,{"$f":"K90-K177","v":243853098}]
[{"$f":"head27a","v":"References"}]
["1. Insert 'Vote'; e.g. Department, if different to standard structure"]
["2. Must reconcile to Financial Performance ('Revenue and Expenditure by Standard Classification' and 'Revenue and Expenditure')"]
["3. Assign share in 'associate' to relevant Vote"]
[]
["check revenue"]
["check expenditure"]

{"sheet":"C4-FinPerf RE","index":11,"n_rows":53,"n_cols":11,"rows_kept":53,"cut":false,"hidden":false,"merged":[[1,0,2,0],[1,1,2,1],[1,3,1,10],[0,0,0,10]]}
[{"$f":"muni& \" - \"&S71B& \" - \"&date","v":"NW375 Moses Kotane - Table C4 Monthly Budget Statement - Financial Performance (revenue and expenditure) - M07 January"}]
[{"$f":"desc","v":"Description"},{"$f":"head27","v":"Ref"},{"$f":"Head1","v":"2019/20"},{"$f":"Head2","v":"Budget Year 2020/21"}]
[null,null,{"$f":"Head5","v":"Audited Outcome"},{"$f":"Head6","v":"Original Budget"},{"$f":"Head7","v":"Adjusted Budget"},{"$f":"Head38","v":"Monthly actual"},{"$f":"Head39","v":"YearTD actual"},{"$f":"Head40","v":"YearTD budget"},{"$f":"Head41","v":"YTD variance"},{"$f":"Head41","v":"YTD variance"},{"$f":"Head8","v":"Full Year Forecast"}]
["R thousands",null,null,null,null,null,null,null,null,"%"]
["Revenue By Source"]
["Property rates",null,141419581.36000001,148602075,148602075,12099935.619999999,84208675.900000006,86684500,{"$f":"G6-H6","v":-2475824.099999994},{"$f":"IF(I6=0,\"\",I6/H6)","v":-2.8561324112153775E-2},148602075]
["Service charges - electricity revenue",null,0,0,0,0,0,-7,7,-1,0]
["Service charges - water revenue",null,164372927.80000001,171527615,171527615,17985456.59,96234866.260000005,100057755,-3822888.7399999946,-3.8206821050502229E-2,171527615]
["Service charges - sanitation revenue",null,2664841.4700000002,2490398,2490398,301653.21999999997,1827939.27,1452724,375215.27,0.25828393418157891,2490398]
["Service charges - refuse revenue",null,10004341.869999999,12474707,12474707,909045.67,6365281.4500000002,7276899,-911617.54999999981,-0.12527555350156705,12474707]
[]
["Rental of facilities and equipment",null,83677.2,30000,30000,6891.37,39468.78,17493,21975.78,1.256261361687532,30000]
["Interest earned - external investments",null,5586509.7199999997,5400000,5400000,26429.72,1560022.16,3150000,-1589977.84,-0.50475486984126983,5400000]
["Interest earned - outstanding debtors",null,62398768,62480550,62480550,5708186.2300000004,37725946.490000002,36446977,1278969.4900000021,3.5091236510506815E-2,62480550]
["Dividends received",null,0,0,0,0,0,0,0,"",0]
["Fines, penalties and forfeits",null,5600000,3000000,3000000,886600,886600,1750000,-863400,-0.49337142857142857,3000000]
["Licences and permits",null,13410,50000,50000,0,0,29162,-29162,-1,50000]
["Agency services",null,null,null,null,null,null,null,0,""]
["Transfers and subsidies",null,434445420.41000003,467694767,550339767,0,429726279.18000001,314144427,115581852.18000001,0.36792583998314893,550339767]
["Other revenue",null,2329020.12,2030500,2030500,22814.14,609915.49,1184428,-574512.51,-0.48505481971044251,2030500]
["Gains",null,1980757.13,0,0,0,0,0,0,"",0]
["Total Revenue (excluding capital transfers and contributions)",null,{"$f":"SUM(C6:C10)+SUM(C12:C21)","v":830899255.08000016},875780612,958425612,37947012.560000002,659184994.98000002,552194358,106990636.98000002,0.19375539686336313,{"$f":"SUM(K6:K10)+SUM(K12:K21)","v":958425612}]
[]
["Expenditure By Type"]
["Employee related costs",null,236924858.34999999,270831407,272119407,19015199,139705628.5,158629912,{"$f":"G25-H25","v":-18924283.5},{"$f":"IF(I25=0,\"\",I25/H25)","v":-0.11929832943486723},272119407]
["Remuneration of councillors",null,24128277.649999999,24819114,24819114,2026094.6,14907625.119999999,14477834,429791.11999999918,2.9686147803600953E-2,24819114]
["Debt impairment",null,201036122.28999999,194602817,194602817,112334413.25,112356118.51000001,113518321,-1162202.4899999946,-1.0238016910063307E-2,194602817]
["Depreciation & asset impairment",null,146795994.87,133503316,133503316,77876911,77876911,77877002,-91,-1.168509285963525E-6,133503316]
["Finance charges",null,5347470.47,3043808,3043808,6028.98,1586336.46,1775571,-189234.54000000004,-0.10657672376942405,3043808]
["Bulk purchases",null,130803587.19,83000000,103000000,9812728.7799999993,46996792.420000002,58416669,-11419876.579999998,-0.19549003350396441,103000000]
["Other materials",null,1816440.16,3827300,3857300,0,1266801.56,2247636,-980834.44,-0.43638491285955555,3857300]
["Contracted services",null,123389435.31999999,91709200,116603685,5742211.71,86310506.950000003,65944455.5,20366051.450000003,0.30883644872918853,116603685]
["Transfers and subsidies",null,0,0,0,0,0,0,0,"",0]
["Other expenditure",null,113324807.95999999,49640300,65518300,3342520.38,33602904.32,36895998,-3293093.6799999997,-8.9253411169417332E-2,65518300]
["Losses",null,22588628.32,0,0,0,429663.03,0,429663.03,{"$error":"#DIV/0!"},0]
["Total Expenditure",null,{"$f":"SUM(C25:C35)","v":1006155622.58},{"$f":"SUM(D25:D35)","v":854977262},{"$f":"SUM(E25:E35)","v":917067747},230156107.69999999,515039287.86999995,529783398.5,-14744110.630000055,-2.783045046663548E-2,917067747]
[]
["Surplus/(Deficit)",null,{"$f":"C22-C36","v":-175256367.49999988},20803350,41357865,-192209095.13999999,144145707.11000007,22410959.5,{"$f":"I22-I36","v":121734747.61000007},5.4319293027145967,{"$f":"K22-K36","v":41357865}]
["Transfers and subsidies - capital (monetary allocations) (National / Provincial and District)",null,68075621.780000001,202495233,202495233,0,0,118122200,{"$f":"G39-H39","v":-118122200},-1,202495233]
["Transfers and subsidies - capital (monetary allocations) (National / Provincial Departmental Agencies, Households, Non-profit Institutions, Private Enterprises, Public Corporatons, Higher Educational Institutions)",null,96552077.219999999,0,0,0,0,0,{"$f":"G40-H40","v":0},"",0]
["Transfers and subsidies - capital (in-kind - all) ",null,0,0,0,0,0,0,{"$f":"G41-H41","v":0},"",0]
["Surplus/(Deficit) after capital transfers & contributions",null,{"$f":"C38+SUM(C39:C41)","v":-10628668.499999881},223298583,243853098,-192209095.13999999,144145707.11000007,140533159.5,null,null,{"$f":"K38+SUM(K39:K41)","v":243853098}]
["Taxation",null,null,null,null,null,null,null,{"$f":"G43-H43","v":0},{"$f":"IF(I43=0,\"\",I43/H43)","v":""}]
["Surplus/(Deficit) after taxation",null,{"$f":"C42-C43","v":-10628668.499999881},223298583,243853098,-192209095.13999999,144145707.11000007,140533159.5,null,null,{"$f":"K42-K43","v":243853098}]
["Attributable to minorities"]
["Surplus/(Deficit) attributable to municipality",null,{"$f":"SUM(C44:C45)","v":-10628668.499999881},223298583,243853098,-192209095.13999999,144145707.11000007,140533159.5,null,null,{"$f":"SUM(K44:K45)","v":243853098}]
["Share of surplus/ (deficit) of associate"]
["Surplus/ (Deficit) for the year",null,{"$f":"C46+C47","v":-10628668.499999881},223298583,243853098,-192209095.13999999,144145707.11000007,140533159.5,null,null,{"$f":"K46+K47","v":243853098}]
[{"$f":"head27a","v":"References"}]
["1. Material variances to be explained on Table SC1"]
[]
[]
[{"$f":"A22&\" including capital transfers/contributions etc\"","v":"Total Revenue (excluding capital transfers and contributions) including capital transfers/contributions etc"},null,{"$f":"C22+SUM(C39:C41)","v":995526954.08000016},1078275845,1160920845,37947012.560000002,659184994.98000002,670316558,null,null,{"$f":"K22+SUM(K39:K41)","v":1160920845}]

{"sheet":"C5-Capex","index":12,"n_rows":86,"n_cols":11,"rows_kept":86,"cut":false,"hidden":false,"merged":[[0,0,0,10],[76,0,76,10],[78,0,78,10],[77,0,77,10],[1,0,2,0],[1,1,2,1]]}
[{"$f":"muni& \" - \"&S71D& \" - \"&date","v":"NW375 Moses Kotane - Table C5 Monthly Budget Statement - Capital Expenditure (municipal vote, functional classification and funding) - M07 January"}]
[{"$f":"Vdesc","v":"Vote Description"},{"$f":"head27","v":"Ref"},{"$f":"Head1","v":"2019/20"},{"$f":"Head2","v":"Budget Year 2020/21"}]
[null,null,{"$f":"Head5","v":"Audited Outcome"},{"$f":"Head6","v":"Original Budget"},{"$f":"Head7","v":"Adjusted Budget"},{"$f":"Head38","v":"Monthly actual"},{"$f":"Head39","v":"YearTD actual"},{"$f":"Head40","v":"YearTD budget"},{"$f":"Head41","v":"YTD variance"},{"$f":"Head41","v":"YTD variance"},{"$f":"Head8","v":"Full Year Forecast"}]
["R thousands",1,null,null,null,null,null,null,null,"%"]
["Multi-Year expenditure appropriation",2]
[{"$f":"'Org structure'!A2","v":"Vote 01 - Municipal Council"},null,{"$f":"'C5C'!C7","v":0},{"$f":"'C5C'!D7","v":0},{"$f":"'C5C'!E7","v":0},{"$f":"'C5C'!F7","v":0},{"$f":"'C5C'!G7","v":0},{"$f":"'C5C'!H7","v":0},{"$f":"G6-H6","v":0},{"$f":"IF(I6=0,\"\",I6/H6)","v":""},{"$f":"'C5C'!K7","v":0}]
[{"$f":"'Org structure'!A3","v":"Vote 02 - Office Of The Accounting Officer"},null,{"$f":"'C5C'!C13","v":0},{"$f":"'C5C'!D13","v":0},{"$f":"'C5C'!E13","v":0},{"$f":"'C5C'!F13","v":0},{"$f":"'C5C'!G13","v":0},{"$f":"'C5C'!H13","v":0},0,"",{"$f":"'C5C'!K13","v":0}]
[{"$f":"'Org structure'!A4","v":"Vote 03 - Budget And Treasury Office"},null,{"$f":"'C5C'!C20","v":41762.17},{"$f":"'C5C'!D20","v":0},{"$f":"'C5C'!E20","v":0},{"$f":"'C5C'!F20","v":0},{"$f":"'C5C'!G20","v":0},{"$f":"'C5C'!H20","v":0},0,"",{"$f":"'C5C'!K20","v":0}]
[{"$f":"'Org structure'!A5","v":"Vote 04 - Corporate Services"},null,{"$f":"'C5C'!C28","v":130496.44},{"$f":"'C5C'!D28","v":1000000},{"$f":"'C5C'!E28","v":1000000},{"$f":"'C5C'!F28","v":0},{"$f":"'C5C'!G28","v":54200},{"$f":"'C5C'!H28","v":583338},-529138,-0.90708645759405349,{"$f":"'C5C'!K28","v":1000000}]
[{"$f":"'Org structure'!A6","v":"Vote 05 - Community Services"},null,{"$f":"'C5C'!C37","v":-2219817},{"$f":"'C5C'!D37","v":20087987},{"$f":"'C5C'!E37","v":20087987},{"$f":"'C5C'!F37","v":889551.83},{"$f":"'C5C'!G37","v":4432601.07},{"$f":"'C5C'!H37","v":11718000},-7285398.9299999997,-0.62172716589861754,{"$f":"'C5C'!K37","v":20087987}]
[{"$f":"'Org structure'!A7","v":"Vote 06 - Planning & Development"},null,{"$f":"'C5C'!C52","v":0},{"$f":"'C5C'!D52","v":0},{"$f":"'C5C'!E52","v":0},{"$f":"'C5C'!F52","v":0},{"$f":"'C5C'!G52","v":0},{"$f":"'C5C'!H52","v":0},0,"",{"$f":"'C5C'!K52","v":0}]
[{"$f":"'Org structure'!A8","v":"Vote 07 - Infrastructure & Technical Services"},null,{"$f":"'C5C'!C63","v":24958199.279999997},{"$f":"'C5C'!D63","v":182407246},{"$f":"'C5C'!E63","v":182407246},{"$f":"'C5C'!F63","v":6015394.3599999994},{"$f":"'C5C'!G63","v":68701156.530000001},{"$f":"'C5C'!H63","v":106404333},-37703176.469999999,-0.35433873233339097,{"$f":"'C5C'!K63","v":182407246}]
[{"$f":"'Org structure'!A9","v":"Vote 08 - "},null,{"$f":"'C5C'!C83","v":0},{"$f":"'C5C'!D83","v":0},{"$f":"'C5C'!E83","v":0},{"$f":"'C5C'!F83","v":0},{"$f":"'C5C'!G83","v":0},{"$f":"'C5C'!H83","v":0},{"$f":"G13-H13","v":0},{"$f":"IF(I13=0,\"\",I13/H13)","v":""},{"$f":"'C5C'!K83","v":0}]
[{"$f":"'Org structure'!A10","v":"Vote 09 - "},null,{"$f":"'C5C'!C84","v":0},{"$f":"'C5C'!D84","v":0},{"$f":"'C5C'!E84","v":0},{"$f":"'C5C'!F84","v":0},{"$f":"'C5C'!G84","v":0},{"$f":"'C5C'!H84","v":0},0,"",{"$f":"'C5C'!K84","v":0}]
[{"$f":"'Org structure'!A11","v":"Vote 10 - "},null,{"$f":"'C5C'!C85","v":0},{"$f":"'C5C'!D85","v":0},{"$f":"'C5C'!E85","v":0},{"$f":"'C5C'!F85","v":0},{"$f":"'C5C'!G85","v":0},{"$f":"'C5C'!H85","v":0},0,"",{"$f":"'C5C'!K85","v":0}]
[{"$f":"'Org structure'!A12","v":"Vote 11 - "},null,{"$f":"'C5C'!C86","v":0},{"$f":"'C5C'!D86","v":0},{"$f":"'C5C'!E86","v":0},{"$f":"'C5C'!F86","v":0},{"$f":"'C5C'!G86","v":0},{"$f":"'C5C'!H86","v":0},0,"",{"$f":"'C5C'!K86","v":0}]
[{"$f":"'Org structure'!A13","v":"Vote 12 - "},null,{"$f":"'C5C'!C87","v":0},{"$f":"'C5C'!D87","v":0},{"$f":"'C5C'!E87","v":0},{"$f":"'C5C'!F87","v":0},{"$f":"'C5C'!G87","v":0},{"$f":"'C5C'!H87","v":0},0,"",{"$f":"'C5C'!K87","v":0}]
[{"$f":"'Org structure'!A14","v":"Vote 13 - "},null,{"$f":"'C5C'!C88","v":0},{"$f":"'C5C'!D88","v":0},{"$f":"'C5C'!E88","v":0},{"$f":"'C5C'!F88","v":0},{"$f":"'C5C'!G88","v":0},{"$f":"'C5C'!H88","v":0},{"$f":"G18-H18","v":0},{"$f":"IF(I18=0,\"\",I18/H18)","v":""},{"$f":"'C5C'!K88","v":0}]
[{"$f":"'Org structure'!A15","v":"Vote 14 - "},null,{"$f":"'C5C'!C89","v":0},{"$f":"'C5C'!D89","v":0},{"$f":"'C5C'!E89","v":0},{"$f":"'C5C'!F89","v":0},{"$f":"'C5C'!G89","v":0},{"$f":"'C5C'!H89","v":0},{"$f":"G19-H19","v":0},{"$f":"IF(I19=0,\"\",I19/H19)","v":""},{"$f":"'C5C'!K89","v":0}]
[{"$f":"'Org structure'!A16","v":"Vote 15 - Other"},null,{"$f":"'C5C'!C90","v":0},{"$f":"'C5C'!D90","v":0},{"$f":"'C5C'!E90","v":0},{"$f":"'C5C'!F90","v":0},{"$f":"'C5C'!G90","v":0},{"$f":"'C5C'!H90","v":0},{"$f":"G20-H20","v":0},{"$f":"IF(I20=0,\"\",I20/H20)","v":""},{"$f":"'C5C'!K90","v":0}]
["Total Capital Multi-year expenditure","4,7",{"$f":"SUM(C6:C20)","v":22910640.889999997},{"$f":"SUM(D6:D20)","v":203495233},203495233,6904946.1899999995,73187957.599999994,118705671,-45517713.399999999,{"$f":"IF(I21=0,\"\",I21/H21)","v":-0.38345020095964916},{"$f":"SUM(K6:K20)","v":203495233}]
[]
["Single Year expenditure appropriation",2]
[{"$f":"'C5C'!A95","v":"Vote 01 - Municipal Council"},null,{"$f":"'C5C'!C95","v":0},{"$f":"'C5C'!D95","v":0},{"$f":"'C5C'!E95","v":0},{"$f":"'C5C'!F95","v":0},{"$f":"'C5C'!G95","v":0},{"$f":"'C5C'!H95","v":0},{"$f":"G24-H24","v":0},{"$f":"IF(I24=0,\"\",I24/H24)","v":""},{"$f":"'C5C'!K95","v":0}]
[{"$f":"'C5C'!A101","v":"Vote 02 - Office Of The Accounting Officer"},null,{"$f":"'C5C'!C101","v":0},{"$f":"'C5C'!D101","v":0},{"$f":"'C5C'!E101","v":0},{"$f":"'C5C'!F101","v":0},{"$f":"'C5C'!G101","v":0},{"$f":"'C5C'!H101","v":0},0,"",{"$f":"'C5C'!K101","v":0}]
[{"$f":"'C5C'!A108","v":"Vote 03 - Budget And Treasury Office"},null,{"$f":"'C5C'!C108","v":0},{"$f":"'C5C'!D108","v":0},{"$f":"'C5C'!E108","v":0},{"$f":"'C5C'!F108","v":0},{"$f":"'C5C'!G108","v":0},{"$f":"'C5C'!H108","v":0},0,"",{"$f":"'C5C'!K108","v":0}]
[{"$f":"'C5C'!A116","v":"Vote 04 - Corporate Services"},null,{"$f":"'C5C'!C116","v":0},{"$f":"'C5C'!D116","v":0},{"$f":"'C5C'!E116","v":0},{"$f":"'C5C'!F116","v":0},{"$f":"'C5C'!G116","v":0},{"$f":"'C5C'!H116","v":0},0,"",{"$f":"'C5C'!K116","v":0}]
[{"$f":"'C5C'!A125","v":"Vote 05 - Community Services"},null,{"$f":"'C5C'!C125","v":0},{"$f":"'C5C'!D125","v":0},{"$f":"'C5C'!E125","v":0},{"$f":"'C5C'!F125","v":0},{"$f":"'C5C'!G125","v":0},{"$f":"'C5C'!H125","v":0},0,"",{"$f":"'C5C'!K125","v":0}]
[{"$f":"'C5C'!A140","v":"Vote 06 - Planning & Development"},null,{"$f":"'C5C'!C140","v":0},{"$f":"'C5C'!D140","v":0},{"$f":"'C5C'!E140","v":0},{"$f":"'C5C'!F140","v":0},{"$f":"'C5C'!G140","v":0},{"$f":"'C5C'!H140","v":0},0,"",{"$f":"'C5C'!K140","v":0}]
[{"$f":"'C5C'!A151","v":"Vote 07 - Infrastructure & Technical Services"},null,{"$f":"'C5C'!C151","v":0},{"$f":"'C5C'!D151","v":0},{"$f":"'C5C'!E151","v":0},{"$f":"'C5C'!F151","v":0},{"$f":"'C5C'!G151","v":0},{"$f":"'C5C'!H151","v":0},0,"",{"$f":"'C5C'!K151","v":0}]
[{"$f":"'Org structure'!A9","v":"Vote 08 - "},null,{"$f":"'C5C'!C171","v":0},{"$f":"'C5C'!D171","v":0},{"$f":"'C5C'!E171","v":0},{"$f":"'C5C'!F171","v":0},{"$f":"'C5C'!G171","v":0},{"$f":"'C5C'!H171","v":0},{"$f":"'C5C'!I171","v":0},{"$f":"IF(I31=0,\"\",I31/H31)","v":""},{"$f":"'C5C'!K171","v":0}]
[{"$f":"'Org structure'!A10","v":"Vote 09 - "},null,{"$f":"'C5C'!C172","v":0},{"$f":"'C5C'!D172","v":0},{"$f":"'C5C'!E172","v":0},{"$f":"'C5C'!F172","v":0},{"$f":"'C5C'!G172","v":0},{"$f":"'C5C'!H172","v":0},{"$f":"'C5C'!I172","v":0},"",{"$f":"'C5C'!K172","v":0}]
[{"$f":"'Org structure'!A11","v":"Vote 10 - "},null,{"$f":"'C5C'!C173","v":0},{"$f":"'C5C'!D173","v":0},{"$f":"'C5C'!E173","v":0},{"$f":"'C5C'!F173","v":0},{"$f":"'C5C'!G173","v":0},{"$f":"'C5C'!H173","v":0},{"$f":"'C5C'!I173","v":0},"",{"$f":"'C5C'!K173","v":0}]
[{"$f":"'Org structure'!A12","v":"Vote 11 - "},null,{"$f":"'C5C'!C174","v":0},{"$f":"'C5C'!D174","v":0},{"$f":"'C5C'!E174","v":0},{"$f":"'C5C'!F174","v":0},{"$f":"'C5C'!G174","v":0},{"$f":"'C5C'!H174","v":0},{"$f":"'C5C'!I174","v":0},"",{"$f":"'C5C'!K174","v":0}]
[{"$f":"'Org structure'!A13","v":"Vote 12 - "},null,{"$f":"'C5C'!C175","v":0},{"$f":"'C5C'!D175","v":0},{"$f":"'C5C'!E175","v":0},{"$f":"'C5C'!F175","v":0},{"$f":"'C5C'!G175","v":0},{"$f":"'C5C'!H175","v":0},{"$f":"'C5C'!I175","v":0},"",{"$f":"'C5C'!K175","v":0}]
[{"$f":"'Org structure'!A14","v":"Vote 13 - "},null,{"$f":"'C5C'!C176","v":0},{"$f":"'C5C'!D176","v":0},{"$f":"'C5C'!E176","v":0},{"$f":"'C5C'!F176","v":0},{"$f":"'C5C'!G176","v":0},{"$f":"'C5C'!H176","v":0},{"$f":"'C5C'!I176","v":0},"",{"$f":"'C5C'!K176","v":0}]
[{"$f":"'Org structure'!A15","v":"Vote 14 - "},null,{"$f":"'C5C'!C177","v":0},{"$f":"'C5C'!D177","v":0},{"$f":"'C5C'!E177","v":0},{"$f":"'C5C'!F177","v":0},{"$f":"'C5C'!G177","v":0},{"$f":"'C5C'!H177","v":0},{"$f":"'C5C'!I177","v":0},"",{"$f":"'C5C'!K177","v":0}]
[{"$f":"'Org structure'!A16","v":"Vote 15 - Other"},null,{"$f":"'C5C'!C178","v":0},{"$f":"'C5C'!D178","v":0},{"$f":"'C5C'!E178","v":0},{"$f":"'C5C'!F178","v":0},{"$f":"'C5C'!G178","v":0},{"$f":"'C5C'!H178","v":0},{"$f":"'C5C'!I178","v":0},"",{"$f":"'C5C'!K178","v":0}]
["Total Capital single-year expenditure",4,{"$f":"SUM(C24:C38)","v":0},0,0,0,0,0,0,"",{"$f":"SUM(K24:K38)","v":0}]
["Total Capital Expenditure",null,{"$f":"C39+C21","v":22910640.889999997},203495233,203495233,6904946.1899999995,73187957.599999994,118705671,-45517713.399999999,{"$f":"IF(I40=0,\"\",I40/H40)","v":-0.38345020095964916},{"$f":"K39+K21","v":203495233}]
[]
["Capital Expenditure - Functional Classification"]
["Governance and administration",null,{"$f":"SUM(C44:C46)","v":172258.61},1000000,1000000,0,54200,583338,{"$f":"G43-H43","v":-529138},{"$f":"IF(I43=0,\"\",I43/H43)","v":-0.90708645759405349},{"$f":"SUM(K44:K46)","v":1000000}]
["Executive and council",null,null,null,null,null,null,null,0,{"$f":"IF(I44=0,\"\",I44/H44)","v":""}]
["Finance and administration",null,172258.61,1000000,1000000,0,54200,583338,-529138,-0.90708645759405349,1000000]
["Internal audit",null,null,null,null,null,null,null,0,""]
["Community and public safety",null,{"$f":"SUM(C48:C52)","v":0},17087987,17087987,889551.83,4432601.07,9968000,-5535398.9299999997,-0.55531690710272874,{"$f":"SUM(K48:K52)","v":17087987}]
["Community and social services",null,0,7223512,7223512,889551.83,1807754.11,4213720,-2405965.8899999997,-0.57098380765689216,7223512]
["Sport and recreation",null,0,9864475,9864475,0,2624846.96,5754280,-3129433.04,-0.54384441493983604,9864475]
["Public safety",null,0,0,0,0,0,0,0,"",0]
["Housing",null,null,null,null,null,null,null,0,""]
["Health",null,null,null,null,null,null,null,0,""]
["Economic and environmental services",null,{"$f":"SUM(C54:C56)","v":1862217.88},60981783,60981783,-2538353.94,23908066.43,35572719,-11664652.57,-0.32791006417024238,{"$f":"SUM(K54:K56)","v":60981783}]
["Planning and development",null,null,null,null,null,null,null,0,""]
["Road transport",null,1862217.88,60981783,60981783,-2538353.94,23908066.43,35572719,-11664652.57,-0.32791006417024238,60981783]
["Environmental protection",null,null,null,null,null,null,null,0,""]
["Trading services",null,{"$f":"SUM(C58:C61)","v":20876164.399999999},124425463,124425463,8553748.3000000007,44793090.100000001,72581614,-27788523.899999999,-0.38285899649462191,{"$f":"SUM(K58:K61)","v":124425463}]
["Energy sources",null,0,12265740,12265740,162522.9,4750472.55,7155057,-2404584.4500000002,-0.33606782587476247,12265740]
["Water management",null,23095981.399999999,83272366,83272366,6447814,28576887.68,48575583,-19998695.32,-0.411702630928794,83272366]
["Waste water management",null,0,25887357,25887357,1943411.4,11465729.869999999,15100974,-3635244.1300000008,-0.24072911654572751,25887357]
["Waste management",null,-2219817,3000000,3000000,0,0,1750000,-1750000,-1,3000000]
["Other",null,null,null,null,null,null,null,0,""]
["Total Capital Expenditure - Functional Classification",3,{"$f":"C43+C47+C53+C57+C62","v":22910640.889999997},{"$f":"D43+D47+D53+D57+D62","v":203495233},203495233,6904946.1900000013,73187957.599999994,118705671,-45517713.399999999,-0.38345020095964916,{"$f":"K43+K47+K53+K57+K62","v":203495233}]
[]
["Funded by:"]
["National Government",null,22738382.280000001,202495233,202495233,5758720.0099999998,70502585.579999998,118122333,{"$f":"G66-H66","v":-47619747.420000002},{"$f":"IF(I66=0,\"\",I66/H66)","v":-0.40313923887703779},202495233]
["Provincial Government",null,0,0,0,0,0,0,0,"",0]
["District Municipality",null,null,null,null,null,null,null,0,""]
[{"$f":"'C4-FinPerf RE'!A40","v":"Transfers and subsidies - capital (monetary allocations) (National / Provincial Departmental Agencies, Households, Non-profit Institutions, Private Enterprises, Public Corporatons, Higher Educational Institutions)"},null,0,0,0,0,0,0,0,"",0]
["Transfers recognised - capital",null,{"$f":"SUM(C66:C69)","v":22738382.280000001},202495233,202495233,5758720.0099999998,70502585.579999998,118122333,-47619747.420000002,-0.40313923887703779,{"$f":"SUM(K66:K69)","v":202495233}]
[]
["Borrowing",6,null,null,null,null,null,null,0,""]
["Internally generated funds",null,172258.61,1000000,1000000,1146226.18,2685372.02,583338,2102034.02,3.6034580637640614,1000000]
["Total Capital Funding",null,{"$f":"+C70+C72+C73","v":22910640.890000001},203495233,203495233,6904946.1899999995,73187957.599999994,118705671,-45517713.400000006,-0.38345020095964921,{"$f":"+K70+K72+K73","v":203495233}]
[{"$f":"head27a","v":"References"}]
["1. Municipalities may choose to appropriate for capital expenditure for three years or for one year (if one year appropriation projected expenditure required for yr2 and yr3)."]
["2. Include capital component of PPP unitary payment"]
["3. Capital expenditure by functional classification must reconcile to the total of multi-year and single year appropriations"]
["4. Include expenditure on investment property, intangible and biological assets"]
[]
["6. Include finance leases and PPP capital funding component of unitary payment - total borrowing/repayments to reconcile to changes in Table SA17"]
[]
[]
[]
[]
["check balance",null,{"$f":"C40-C74","v":0},{"$f":"D40-D74","v":0},0,0,0,0,null,null,0]

{"sheet":"C5C","index":13,"n_rows":182,"n_cols":23,"rows_kept":182,"cut":false,"hidden":false,"merged":[[1,3,1,10],[1,11,1,22],[0,0,0,10]]}
[{"$f":"muni& \" - \"&S71D& \" - \"&\"A\"& \" - \"&date","v":"NW375 Moses Kotane - Table C5 Monthly Budget Statement - Capital Expenditure (municipal vote, functional classification and funding) - A - M07 January"}]
[{"$f":"Vdesc","v":"Vote Description"},{"$f":"head27","v":"Ref"},{"$f":"Head1","v":"2019/20"},{"$f":"Head2","v":"Budget Year 2020/21"},null,null,null,null,null,null,null,{"$f":"Head4","v":{"$error":"#REF!"}}]
["R thousand",null,{"$f":"Head5","v":"Audited Outcome"},{"$f":"Head6","v":"Original Budget"},{"$f":"Head7","v":"Adjusted Budget"},{"$f":"Head38","v":"Monthly actual"},{"$f":"Head39","v":"YearTD actual"},{"$f":"Head40","v":"YearTD budget"},{"$f":"Head41","v":"YTD variance"},{"$f":"Head41","v":"YTD variance"},{"$f":"Head8","v":"Full Year Forecast"},{"$f":"Head12","v":"Forecast 2010/11"},{"$f":"Head13","v":"Forecast 2011/12"},{"$f":"Head14","v":"Forecast 2012/13"},{"$f":"Head15","v":"Forecast 2013/14"},{"$f":"Head16","v":"Forecast 2014/15"},{"$f":"Head17","v":"Forecast 2015/16"},{"$f":"Head18","v":"Forecast 2016/17"},{"$f":"Head19","v":"Forecast 2017/18"},{"$f":"Head20","v":"Forecast 2018/19"},{"$f":"Head21","v":"Forecast 2019/20"},{"$f":"Head22","v":"Forecast 2020/21"},{"$f":"Head23","v":"Forecast 2021/22"}]
[null,null,null,null,null,null,null,null,null,"%"]
["Capital expenditure - Municipal Vote"]
["Expenditure of multi-year capital appropriation",1]
[{"$f":"'Org structure'!A2","v":"Vote 01 - Municipal Council"},null,{"$f":"SUM(C8:C12)","v":0},0,0,0,0,0,{"$f":"G7-H7","v":0},{"$f":"IF(I7=0,\"\",I7/H7)","v":""},{"$f":"SUM(K8:K12)","v":0}]
[{"$f":"'Org structure'!E3","v":"01.1 - Office Of The Mayor"},null,null,null,null,null,null,null,{"$f":"G8-H8","v":0},{"$f":"IF(I8=0,\"\",I8/H8)","v":""},0]
[{"$f":"'Org structure'!E4","v":"01.2 - Office Of The Speaker"},null,null,null,null,null,null,null,{"$f":"G9-H9","v":0},{"$f":"IF(I9=0,\"\",I9/H9)","v":""},0]
[{"$f":"'Org structure'!E5","v":"01.3 - Office Of The Chief Whip"},null,null,null,null,null,null,null,{"$f":"G10-H10","v":0},{"$f":"IF(I10=0,\"\",I10/H10)","v":""},0]
[{"$f":"'Org structure'!E6","v":"01.4 - Mpac"},null,null,null,null,null,null,null,{"$f":"G11-H11","v":0},{"$f":"IF(I11=0,\"\",I11/H11)","v":""},0]
[{"$f":"'Org structure'!E7","v":"01.5 - Council General Administration"},null,null,null,null,null,null,null,{"$f":"G12-H12","v":0},{"$f":"IF(I12=0,\"\",I12/H12)","v":""},0]
[{"$f":"'Org structure'!A3","v":"Vote 02 - Office Of The Accounting Officer"},null,{"$f":"SUM(C14:C19)","v":0},0,0,0,0,0,0,"",{"$f":"SUM(K14:K19)","v":0}]
[{"$f":"'Org structure'!E9","v":"02.1 - Office Of The Ao Admin"},null,null,null,null,null,null,null,{"$f":"G14-H14","v":0},{"$f":"IF(I14=0,\"\",I14/H14)","v":""},0]
[{"$f":"'Org structure'!E10","v":"02.2 - Strategic Planning Monitoring & Evaluat"},null,null,null,null,null,null,null,0,"",0]
[{"$f":"'Org structure'!E11","v":"02.3 - Perfomance Management System"},null,null,null,null,null,null,null,0,"",0]
[{"$f":"'Org structure'!E12","v":"02.4 - Internal Audit"},null,null,null,null,null,null,null,0,"",0]
[{"$f":"'Org structure'!E13","v":"02.5 - Municipal Planning Idp"},null,null,null,null,null,null,null,0,"",0]
[{"$f":"'Org structure'!E14","v":"02.6 - Risk"},null,null,null,null,null,null,null,0,"",0]
[{"$f":"'Org structure'!A4","v":"Vote 03 - Budget And Treasury Office"},null,{"$f":"SUM(C21:C27)","v":41762.17},0,0,0,0,0,0,"",{"$f":"SUM(K21:K27)","v":0}]
[{"$f":"'Org structure'!E16","v":"03.1 - Chief Financial Officer Admin"},null,null,null,null,null,null,null,{"$f":"G21-H21","v":0},{"$f":"IF(I21=0,\"\",I21/H21)","v":""},0]
[{"$f":"'Org structure'!E17","v":"03.2 - Budget Expenditure & Reporting"},null,null,null,null,null,null,null,0,"",0]
[{"$f":"'Org structure'!E18","v":"03.3 - Budget Expenditure & Reporting"},null,null,null,null,null,null,null,0,"",0]
[{"$f":"'Org structure'!E19","v":"03.4 - Revenue Management"},null,41762.17,0,0,0,0,0,0,"",0]
[{"$f":"'Org structure'!E20","v":"03.5 - Supply Chain Management"},null,null,null,null,null,null,null,0,"",0]
[{"$f":"'Org structure'!E21","v":"03.6 - Assets Management"},null,null,null,null,null,null,null,0,"",0]
[{"$f":"'Org structure'!E22","v":"03.7 - Expenditure"},null,null,null,null,null,null,null,0,"",0]
[{"$f":"'Org structure'!A5","v":"Vote 04 - Corporate Services"},null,{"$f":"SUM(C29:C36)","v":130496.44},1000000,1000000,0,54200,583338,-529138,-0.90708645759405349,{"$f":"SUM(K29:K36)","v":1000000}]
[{"$f":"'Org structure'!E24","v":"04.1 - Legal Services"},null,null,null,null,null,null,null,{"$f":"G29-H29","v":0},{"$f":"IF(I29=0,\"\",I29/H29)","v":""},0]
[{"$f":"'Org structure'!E25","v":"04.2 - Corporate Service Administration"},null,130496.44,500000,500000,0,54200,291669,-237469,-0.81417291518810708,500000]
[{"$f":"'Org structure'!E26","v":"04.3 - Human Resources"},null,0,500000,500000,0,0,291669,-291669,-1,500000]
[{"$f":"'Org structure'!E27","v":"04.4 - Media & Communication"},null,null,null,null,null,null,null,0,"",0]
[{"$f":"'Org structure'!E28","v":"04.5 - Organisational Development"},null,null,null,null,null,null,null,0,"",0]
[{"$f":"'Org structure'!E29","v":"04.6 - Labour Relations"},null,null,null,null,null,null,null,0,"",0]
[{"$f":"'Org structure'!E30","v":"04.7 - Legal Services"},null,null,null,null,null,null,null,0,"",0]
[{"$f":"'Org structure'!E31","v":"04.8 - Information Technology Services"},null,0,0,0,0,0,0,0,"",0]
[{"$f":"'Org structure'!A6","v":"Vote 05 - Community Services"},null,{"$f":"SUM(C38:C51)","v":-2219817},20087987,20087987,889551.83,4432601.07,11718000,-7285398.9299999997,-0.62172716589861754,{"$f":"SUM(K38:K51)","v":20087987}]
[{"$f":"'Org structure'!E33","v":"05.1 - Municipal Buildings"},null,0,7223512,7223512,889551.83,1807754.11,4213720,{"$f":"G38-H38","v":-2405965.8899999997},{"$f":"IF(I38=0,\"\",I38/H38)","v":-0.57098380765689216},7223512]
[{"$f":"'Org structure'!E34","v":"05.2 - Fleet Management"},null,0,0,0,0,0,0,0,"",0]
[{"$f":"'Org structure'!E35","v":"05.3 - Community Services Administration"},null,null,null,null,null,null,null,0,"",0]
[{"$f":"'Org structure'!E36","v":"05.4 - Cemeteries"},null,0,0,0,0,0,0,0,"",0]
[{"$f":"'Org structure'!E37","v":"05.5 - Disaster Management"},null,null,null,null,null,null,null,0,"",0]
[{"$f":"'Org structure'!E38","v":"05.6 - Fires Service"},null,null,null,null,null,null,null,0,"",0]
[{"$f":"'Org structure'!E39","v":"05.7 - Libraries"},null,null,null,null,null,null,null,0,"",0]
[{"$f":"'Org structure'!E40","v":"05.8 - Municipal Buildings"},null,0,0,0,0,0,0,0,"",0]
[{"$f":"'Org structure'!E41","v":"05.9 - Sports Recreation & Social Amenitie"},null,0,9864475,9864475,0,2624846.96,5754280,-3129433.04,-0.54384441493983604,9864475]
[{"$f":"'Org structure'!E42","v":"05.10 - Waste Management Solid Waste"},null,-2219817,3000000,3000000,0,0,1750000,-1750000,-1,3000000]
[{"$f":"'Org structure'!E43","v":"05.11 - Safety And Security"},null,0,0,0,0,0,0,0,"",0]
[{"$f":"'Org structure'!E44","v":"05.12 - Traffic Service"},null,null,null,null,null,null,null,0,"",0]
[{"$f":"'Org structure'!E45","v":"05.13 - Traffic Service"},null,null,null,null,null,null,null,0,"",0]
[{"$f":"'Org structure'!E46","v":"05.14 - Fleet Management"},null,0,0,0,0,0,0,0,"",0]
[{"$f":"'Org structure'!A7","v":"Vote 06 - Planning & Development"},null,{"$f":"SUM(C53:C62)","v":0},0,0,0,0,0,0,"",{"$f":"SUM(K53:K62)","v":0}]
[{"$f":"'Org structure'!E48","v":"06.1 - Planning And Development Admin"},null,null,null,null,null,null,null,{"$f":"G53-H53","v":0},{"$f":"IF(I53=0,\"\",I53/H53)","v":""},0]
[{"$f":"'Org structure'!E49","v":"06.2 - Municipal Planning Idp"},null,null,null,null,null,null,null,0,"",0]
[{"$f":"'Org structure'!E50","v":"06.3 - Pms"},null,null,null,null,null,null,null,0,"",0]
[{"$f":"'Org structure'!E51","v":"06.4 - Town Planning"},null,null,null,null,null,null,null,0,"",0]
[{"$f":"'Org structure'!E52","v":"06.5 - Land Use And Housing Admin"},null,null,null,null,null,null,null,0,"",0]
[{"$f":"'Org structure'!E53","v":"06.6 - Local Economic Development"},null,null,null,null,null,null,null,0,"",0]
[{"$f":"'Org structure'!E54","v":"06.7 - Led"},null,null,null,null,null,null,null,0,"",0]
[{"$f":"'Org structure'!E55","v":"06.8 - Agriculture & Rural Development"},null,null,null,null,null,null,null,0,"",0]
[{"$f":"'Org structure'!E56","v":"06.9 - Tourism & Business Development"},null,null,null,null,null,null,null,0,"",0]
[{"$f":"'Org structure'!E57","v":"06.10 - Arts & Culture"},null,null,null,null,null,null,null,0,"",0]
[{"$f":"'Org structure'!A8","v":"Vote 07 - Infrastructure & Technical Services"},null,{"$f":"SUM(C64:C82)","v":24958199.279999997},182407246,182407246,6015394.3599999994,68701156.530000001,106404333,{"$f":"G63-H63","v":-37703176.469999999},{"$f":"IF(I63=0,\"\",I63/H63)","v":-0.35433873233339097},{"$f":"SUM(K64:K82)","v":182407246}]
[{"$f":"'Org structure'!E59","v":"07.1 - Infrastructure Admin & Tech Admin"},null,null,null,null,null,null,null,{"$f":"G64-H64","v":0},{"$f":"IF(I64=0,\"\",I64/H64)","v":""},0]
[{"$f":"'Org structure'!E60","v":"07.2 - Fleet Management"},null,0,0,0,0,0,0,0,"",0]
[{"$f":"'Org structure'!E61","v":"07.3 - Roads"},null,1862217.88,60981783,60981783,-2538353.94,23908066.43,35572719,-11664652.57,-0.32791006417024238,60981783]
[{"$f":"'Org structure'!E62","v":"07.4 - Storm Water"},null,null,null,null,null,null,null,0,"",0]
[{"$f":"'Org structure'!E63","v":"07.5 - Street Lighting"},null,0,12265740,12265740,162522.9,4750472.55,7155057,-2404584.4500000002,-0.33606782587476247,12265740]
[{"$f":"'Org structure'!E64","v":"07.6 - Project Management Unit"},null,null,null,null,null,null,null,0,"",0]
[{"$f":"'Org structure'!E65","v":"07.7 - Sanitation Treatment Plant: Mogwase"},null,null,null,null,null,null,null,0,"",0]
[{"$f":"'Org structure'!E66","v":"07.8 - Sanitation Treatment Plant: Madikwe"},null,null,null,null,null,null,null,0,"",0]
[{"$f":"'Org structure'!E67","v":"07.9 - Sanitation Reticulation"},null,0,25887357,25887357,1943411.4,11465729.869999999,15100974,-3635244.1300000008,-0.24072911654572751,25887357]
[{"$f":"'Org structure'!E68","v":"07.10 - Water Administration"},null,23095981.399999999,83272366,83272366,6447814,28576887.68,48575583,-19998695.32,-0.411702630928794,83272366]
[{"$f":"'Org structure'!E69","v":"07.11 - Water Madikwe: Water Treatment Work"},null,null,null,null,null,null,null,0,"",0]
[{"$f":"'Org structure'!E70","v":"07.12 - Water: Pella Water Treatment Works"},null,null,null,null,null,null,null,0,"",0]
[{"$f":"'Org structure'!E71","v":"07.13 - Water: Madikwe Retail & Bulk Lines"},null,null,null,null,null,null,null,0,"",0]
[{"$f":"'Org structure'!E72","v":"07.14 - Water: Madikwe Rural"},null,null,null,null,null,null,null,0,"",0]
[{"$f":"'Org structure'!E73","v":"07.15 - Water: Molatedi"},null,null,null,null,null,null,null,0,"",0]
[{"$f":"'Org structure'!E74","v":"07.16 - Water Eastern: Retail Mankwe"},null,null,null,null,null,null,null,0,"",0]
[{"$f":"'Org structure'!E75","v":"07.17 - Water Vaalkopdam: Mankwe"},null,null,null,null,null,null,null,0,"",0]
[{"$f":"'Org structure'!E76","v":"07.18 - Water Eastern: Retail Mankwe"},null,null,null,null,null,null,null,0,"",0]
[{"$f":"'Org structure'!E77","v":"07.19 - Reporting Function Electricity"},null,null,null,null,null,null,null,0,"",0]
[{"$f":"'Org structure'!A9","v":"Vote 08 - "},null,0,0,0,0,0,0,0,"",0]
[{"$f":"'Org structure'!A10","v":"Vote 09 - "},null,0,0,0,0,0,0,0,"",0]
[{"$f":"'Org structure'!A11","v":"Vote 10 - "},null,0,0,0,0,0,0,0,"",0]
[{"$f":"'Org structure'!A12","v":"Vote 11 - "},null,0,0,0,0,0,0,0,"",0]
[{"$f":"'Org structure'!A13","v":"Vote 12 - "},null,0,0,0,0,0,0,0,"",0]
[{"$f":"'Org structure'!A14","v":"Vote 13 - "},null,0,0,0,0,0,0,{"$f":"G88-H88","v":0},{"$f":"IF(I88=0,\"\",I88/H88)","v":""},0]
[{"$f":"'Org structure'!A15","v":"Vote 14 - "},null,0,0,0,0,0,0,0,"",0]
[{"$f":"'Org structure'!A16","v":"Vote 15 - Other"},null,0,0,0,0,0,0,0,"",0]
["Total multi-year capital expenditure",null,{"$f":"C7+C13+C20+C28+C37+C52+C63+C83+C84+C85+C86+C87+C88+C89+C90","v":22910640.889999997},203495233,203495233,6904946.1899999995,73187957.599999994,118705671,-45517713.400000006,-0.38345020095964921,{"$f":"K7+K13+K20+K28+K37+K52+K63+K83+K84+K85+K86+K87+K88+K89+K90","v":203495233}]
[null,null,null,null,null,null,null,null,0,""]
["Capital expenditure - Municipal Vote"]
["Expenditue of single-year capital appropriation",1,null,null,null,null,null,null,0,""]
[{"$f":"'Org structure'!A2","v":"Vote 01 - Municipal Council"},null,{"$f":"SUM(C96:C100)","v":0},0,0,0,0,0,0,"",{"$f":"SUM(K96:K100)","v":0}]
[{"$f":"'Org structure'!E3","v":"01.1 - Office Of The Mayor"},null,0,0,0,0,0,0,0,"",0]
[{"$f":"'Org structure'!E4","v":"01.2 - Office Of The Speaker"},null,0,0,0,0,0,0,0,"",0]
[{"$f":"'Org structure'!E5","v":"01.3 - Office Of The Chief Whip"},null,0,0,0,0,0,0,0,"",0]
[{"$f":"'Org structure'!E6","v":"01.4 - Mpac"},null,0,0,0,0,0,0,0,"",0]
[{"$f":"'Org structure'!E7","v":"01.5 - Council General Administration"},null,0,0,0,0,0,0,0,"",0]
[{"$f":"'Org structure'!A3","v":"Vote 02 - Office Of The Accounting Officer"},null,{"$f":"SUM(C102:C107)","v":0},0,0,0,0,0,0,"",{"$f":"SUM(K102:K107)","v":0}]
[{"$f":"'Org structure'!E9","v":"02.1 - Office Of The Ao Admin"},null,0,0,0,0,0,0,0,"",0]
[{"$f":"'Org structure'!E10","v":"02.2 - Strategic Planning Monitoring & Evaluat"},null,0,0,0,0,0,0,0,"",0]
[{"$f":"'Org structure'!E11","v":"02.3 - Perfomance Management System"},null,0,0,0,0,0,0,0,"",0]
[{"$f":"'Org structure'!E12","v":"02.4 - Internal Audit"},null,0,0,0,0,0,0,0,"",0]
[{"$f":"'Org structure'!E13","v":"02.5 - Municipal Planning Idp"},null,0,0,0,0,0,0,0,"",0]
[{"$f":"'Org structure'!E14","v":"02.6 - Risk"},null,0,0,0,0,0,0,0,"",0]
[{"$f":"'Org structure'!A4","v":"Vote 03 - Budget And Treasury Office"},null,{"$f":"SUM(C109:C115)","v":0},0,0,0,0,0,0,"",{"$f":"SUM(K109:K115)","v":0}]
[{"$f":"'Org structure'!E16","v":"03.1 - Chief Financial Officer Admin"},null,0,0,0,0,0,0,0,"",0]
[{"$f":"'Org structure'!E17","v":"03.2 - Budget Expenditure & Reporting"},null,0,0,0,0,0,0,{"$f":"G110-H110","v":0},{"$f":"IF(I110=0,\"\",I110/H110)","v":""},0]
[{"$f":"'Org structure'!E18","v":"03.3 - Budget Expenditure & Reporting"},null,0,0,0,0,0,0,0,"",0]
[{"$f":"'Org structure'!E19","v":"03.4 - Revenue Management"},null,0,0,0,0,0,0,0,"",0]
[{"$f":"'Org structure'!E20","v":"03.5 - Supply Chain Management"},null,0,0,0,0,0,0,0,"",0]
[{"$f":"'Org structure'!E21","v":"03.6 - Assets Management"},null,0,0,0,0,0,0,0,"",0]
[{"$f":"'Org structure'!E22","v":"03.7 - Expenditure"},null,0,0,0,0,0,0,0,"",0]
[{"$f":"'Org structure'!A5","v":"Vote 04 - Corporate Services"},null,{"$f":"SUM(C117:C124)","v":0},0,0,0,0,0,0,"",{"$f":"SUM(K117:K124)","v":0}]
[{"$f":"'Org structure'!E24","v":"04.1 - Legal Services"},null,0,0,0,0,0,0,0,"",0]
[{"$f":"'Org structure'!E25","v":"04.2 - Corporate Service Administration"},null,0,0,0,0,0,0,0,"",0]
[{"$f":"'Org structure'!E26","v":"04.3 - Human Resources"},null,0,0,0,0,0,0,0,"",0]
[{"$f":"'Org structure'!E27","v":"04.4 - Media & Communication"},null,0,0,0,0,0,0,0,"",0]
[{"$f":"'Org structure'!E28","v":"04.5 - Organisational Development"},null,0,0,0,0,0,0,0,"",0]
[{"$f":"'Org structure'!E29","v":"04.6 - Labour Relations"},null,0,0,0,0,0,0,0,"",0]
[{"$f":"'Org structure'!E30","v":"04.7 - Legal Services"},null,0,0,0,0,0,0,0,"",0]
[{"$f":"'Org structure'!E31","v":"04.8 - Information Technology Services"},null,0,0,0,0,0,0,0,"",0]
[{"$f":"'Org structure'!A6","v":"Vote 05 - Community Services"},null,{"$f":"SUM(C126:C139)","v":0},0,0,0,0,0,0,"",{"$f":"SUM(K126:K139)","v":0}]
[{"$f":"'Org structure'!E33","v":"05.1 - Municipal Buildings"},null,0,0,0,0,0,0,0,"",0]
[{"$f":"'Org structure'!E34","v":"05.2 - Fleet Management"},null,0,0,0,0,0,0,0,"",0]
[{"$f":"'Org structure'!E35","v":"05.3 - Community Services Administration"},null,0,0,0,0,0,0,0,"",0]
[{"$f":"'Org structure'!E36","v":"05.4 - Cemeteries"},null,0,0,0,0,0,0,0,"",0]
[{"$f":"'Org structure'!E37","v":"05.5 - Disaster Management"},null,0,0,0,0,0,0,0,"",0]
[{"$f":"'Org structure'!E38","v":"05.6 - Fires Service"},null,0,0,0,0,0,0,0,"",0]
[{"$f":"'Org structure'!E39","v":"05.7 - Libraries"},null,0,0,0,0,0,0,0,"",0]
[{"$f":"'Org structure'!E40","v":"05.8 - Municipal Buildings"},null,0,0,0,0,0,0,0,"",0]
[{"$f":"'Org structure'!E41","v":"05.9 - Sports Recreation & Social Amenitie"},null,0,0,0,0,0,0,0,"",0]
[{"$f":"'Org structure'!E42","v":"05.10 - Waste Management Solid Waste"},null,0,0,0,0,0,0,null,null,0]
[{"$f":"'Org structure'!E43","v":"05.11 - Safety And Security"},null,0,0,0,0,0,0,null,null,0]
[{"$f":"'Org structure'!E44","v":"05.12 - Traffic Service"},null,0,0,0,0,0,0,null,null,0]
[{"$f":"'Org structure'!E45","v":"05.13 - Traffic Service"},null,0,0,0,0,0,0,null,null,0]
[{"$f":"'Org structure'!E46","v":"05.14 - Fleet Management"},null,0,0,0,0,0,0,null,null,0]
[{"$f":"'Org structure'!A7","v":"Vote 06 - Planning & Development"},null,{"$f":"SUM(C141:C150)","v":0},0,0,0,0,0,0,"",{"$f":"SUM(K141:K150)","v":0}]
[{"$f":"'Org structure'!E48","v":"06.1 - Planning And Development Admin"},null,0,0,0,0,0,0,0,"",0]
[{"$f":"'Org structure'!E49","v":"06.2 - Municipal Planning Idp"},null,0,0,0,0,0,0,0,"",0]
[{"$f":"'Org structure'!E50","v":"06.3 - Pms"},null,0,0,0,0,0,0,0,"",0]
[{"$f":"'Org structure'!E51","v":"06.4 - Town Planning"},null,0,0,0,0,0,0,0,"",0]
[{"$f":"'Org structure'!E52","v":"06.5 - Land Use And Housing Admin"},null,0,0,0,0,0,0,0,"",0]
[{"$f":"'Org structure'!E53","v":"06.6 - Local Economic Development"},null,0,0,0,0,0,0,0,"",0]
[{"$f":"'Org structure'!E54","v":"06.7 - Led"},null,0,0,0,0,0,0,0,"",0]
[{"$f":"'Org structure'!E55","v":"06.8 - Agriculture & Rural Development"},null,0,0,0,0,0,0,0,"",0]
[{"$f":"'Org structure'!E56","v":"06.9 - Tourism & Business Development"},null,0,0,0,0,0,0,0,"",0]
[{"$f":"'Org structure'!E57","v":"06.10 - Arts & Culture"},null,0,0,0,0,0,0,null,null,0]
[{"$f":"'Org structure'!A8","v":"Vote 07 - Infrastructure & Technical Services"},null,{"$f":"SUM(C152:C170)","v":0},0,0,0,0,0,0,"",{"$f":"SUM(K152:K170)","v":0}]
[{"$f":"'Org structure'!E59","v":"07.1 - Infrastructure Admin & Tech Admin"},null,0,0,0,0,0,0,0,"",0]
[{"$f":"'Org structure'!E60","v":"07.2 - Fleet Management"},null,0,0,0,0,0,0,0,"",0]
[{"$f":"'Org structure'!E61","v":"07.3 - Roads"},null,0,0,0,0,0,0,0,"",0]
[{"$f":"'Org structure'!E62","v":"07.4 - Storm Water"},null,0,0,0,0,0,0,0,"",0]
[{"$f":"'Org structure'!E63","v":"07.5 - Street Lighting"},null,0,0,0,0,0,0,0,"",0]
[{"$f":"'Org structure'!E64","v":"07.6 - Project Management Unit"},null,0,0,0,0,0,0,0,"",0]
[{"$f":"'Org structure'!E65","v":"07.7 - Sanitation Treatment Plant: Mogwase"},null,0,0,0,0,0,0,0,"",0]
[{"$f":"'Org structure'!E66","v":"07.8 - Sanitation Treatment Plant: Madikwe"},null,0,0,0,0,0,0,0,"",0]
[{"$f":"'Org structure'!E67","v":"07.9 - Sanitation Reticulation"},null,0,0,0,0,0,0,0,"",0]
[{"$f":"'Org structure'!E68","v":"07.10 - Water Administration"},null,0,0,0,0,0,0,null,null,0]
[{"$f":"'Org structure'!E69","v":"07.11 - Water Madikwe: Water Treatment Work"},null,0,0,0,0,0,0,null,null,0]
[{"$f":"'Org structure'!E70","v":"07.12 - Water: Pella Water Treatment Works"},null,0,0,0,0,0,0,null,null,0]
[{"$f":"'Org structure'!E71","v":"07.13 - Water: Madikwe Retail & Bulk Lines"},null,0,0,0,0,0,0,null,null,0]
[{"$f":"'Org structure'!E72","v":"07.14 - Water: Madikwe Rural"},null,0,0,0,0,0,0,null,null,0]
[{"$f":"'Org structure'!E73","v":"07.15 - Water: Molatedi"},null,0,0,0,0,0,0,null,null,0]
[{"$f":"'Org structure'!E74","v":"07.16 - Water Eastern: Retail Mankwe"},null,0,0,0,0,0,0,null,null,0]
[{"$f":"'Org structure'!E75","v":"07.17 - Water Vaalkopdam: Mankwe"},null,0,0,0,0,0,0,null,null,0]
[{"$f":"'Org structure'!E76","v":"07.18 - Water Eastern: Retail Mankwe"},null,0,0,0,0,0,0,null,null,0]
[{"$f":"'Org structure'!E77","v":"07.19 - Reporting Function Electricity"},null,0,0,0,0,0,0,null,null,0]
[{"$f":"'Org structure'!A9","v":"Vote 08 - "},null,0,0,0,0,0,0,0,"",0]
[{"$f":"'Org structure'!A10","v":"Vote 09 - "},null,0,0,0,0,0,0,{"$f":"G172-H172","v":0},{"$f":"IF(I172=0,\"\",I172/H172)","v":""},0]
[{"$f":"'Org structure'!A11","v":"Vote 10 - "},null,0,0,0,0,0,0,0,"",0]
[{"$f":"'Org structure'!A12","v":"Vote 11 - "},null,0,0,0,0,0,0,0,"",0]
[{"$f":"'Org structure'!A13","v":"Vote 12 - "},null,0,0,0,0,0,0,0,"",0]
[{"$f":"'Org structure'!A14","v":"Vote 13 - "},null,0,0,0,0,0,0,0,"",0]
[{"$f":"'Org structure'!A15","v":"Vote 14 - "},null,0,0,0,0,0,0,0,"",0]
[{"$f":"'Org structure'!A16","v":"Vote 15 - Other"},null,0,0,0,0,0,0,{"$f":"G178-H178","v":0},{"$f":"IF(I178=0,\"\",I178/H178)","v":""},0]
["Total single-year capital expenditure",null,{"$f":"C95+C101+C108+C116+C125+C140+C151+C171+C172+C173+C174+C175+C176+C177+C178","v":0},0,0,0,0,0,0,"",{"$f":"K95+K101+K108+K116+K125+K140+K151+K171+K172+K173+K174+K175+K176+K177+K178","v":0}]
["Total Capital Expenditure",null,{"$f":"C91+C179","v":22910640.889999997},203495233,203495233,6904946.1899999995,73187957.599999994,118705671,-45517713.400000006,-0.38345020095964921,{"$f":"K91+K179","v":203495233}]
[{"$f":"head27a","v":"References"}]
["1. Insert 'Vote'; e.g. Department, if different to standard structure"]

{"sheet":"C6-FinPos","index":14,"n_rows":54,"n_cols":7,"rows_kept":54,"cut":false,"hidden":false,"merged":[[1,0,2,0],[1,1,2,1],[49,0,49,6],[0,0,0,6]]}
[{"$f":"muni& \" - \"&S71E& \" - \"&date","v":"NW375 Moses Kotane - Table C6 Monthly Budget Statement - Financial Position - M07 January"}]
[{"$f":"desc","v":"Description"},{"$f":"head27","v":"Ref"},{"$f":"Head1","v":"2019/20"},{"$f":"Head2","v":"Budget Year 2020/21"}]
[null,null,{"$f":"Head5","v":"Audited Outcome"},{"$f":"Head6","v":"Original Budget"},{"$f":"Head7","v":"Adjusted Budget"},{"$f":"Head39","v":"YearTD actual"},{"$f":"Head8","v":"Full Year Forecast"}]
["R thousands",1]
["ASSETS"]
["Current assets"]
["Cash",null,4015680.42,1328000,11760218,299019721.76999998,11760218]
["Call investment deposits",null,44764970.390000001,17712753,42796851,-147413650.16,42796851]
["Consumer debtors",null,62378187.890000001,127002838,336731922,108250631.04000004,336731922]
["Other debtors",null,70900472.129999995,18000000,70820448,69615055.040000007,70820448]
["Current portion of long-term receivables"]
["Inventory",null,9751477.5199999996,5000000,9751478,11557841.15,9751478]
["Total current assets",null,{"$f":"SUM(C7:C12)","v":191810788.34999999},{"$f":"SUM(D7:D12)","v":169043591},{"$f":"SUM(E7:E12)","v":471860917},{"$f":"SUM(F7:F12)","v":341029598.84000003},{"$f":"SUM(G7:G12)","v":471860917}]
[]
["Non current assets"]
["Long-term receivables",null,0,0,0,0,0]
["Investments",null,0,0,0,0,0]
["Investment property",null,154834421.58000001,155209867,154834422,154834421.58000001,154834422]
["Investments in Associate"]
["Property, plant and equipment",null,2905440967.8800001,3531746542,3111327750,2904002835.4800005,3111327750]
[]
["Biological"]
["Intangible",null,9161157.3100000005,0,9161158,5910336.3099999996,9161158]
["Other non-current assets",null,14000,14000,14000,14000,14000]
["Total non current assets",null,{"$f":"SUM(C16:C20)+SUM(C22:C24)","v":3069450546.77},{"$f":"SUM(D16:D20)+SUM(D22:D24)","v":3686970409},{"$f":"SUM(E16:E20)+SUM(E22:E24)","v":3275337330},{"$f":"SUM(F16:F20)+SUM(F22:F24)","v":3064761593.3700004},{"$f":"SUM(G16:G20)+SUM(G22:G24)","v":3275337330}]
["TOTAL ASSETS",null,{"$f":"C13+C25","v":3261261335.1199999},{"$f":"D13+D25","v":3856014000},{"$f":"E13+E25","v":3747198247},{"$f":"F13+F25","v":3405791192.2100005},{"$f":"G13+G25","v":3747198247}]
[]
["LIABILITIES"]
["Current liabilities"]
["Bank overdraft",null,0,0,0,0,0]
["Borrowing",null,35987887.289999999,41362000,30187889,27059115.73,30187889]
["Consumer deposits",null,15500,0,15500,22033.99,15500]
["Trade and other payables",null,303291422.60000002,45000000,303291421,314217075.46999997,303291421]
["Provisions",null,34935429.969999999,0,34935430,33504226.649999999,34935430]
["Total current liabilities",null,{"$f":"SUM(C30:C34)","v":374230239.86000001},{"$f":"SUM(D30:D34)","v":86362000},{"$f":"SUM(E30:E34)","v":368430240},{"$f":"SUM(F30:F34)","v":374802451.83999991},{"$f":"SUM(G30:G34)","v":368430240}]
[]
["Non current liabilities"]
["Borrowing",null,0,0,0,0,0]
["Provisions",null,30725685.369999997,29829314,30725686,31075685.369999997,30725686]
["Total non current liabilities",null,{"$f":"SUM(C38:C39)","v":30725685.369999997},{"$f":"SUM(D38:D39)","v":29829314},{"$f":"SUM(E38:E39)","v":30725686},{"$f":"SUM(F38:F39)","v":31075685.369999997},{"$f":"SUM(G38:G39)","v":30725686}]
["TOTAL LIABILITIES",null,{"$f":"C35+C40","v":404955925.23000002},{"$f":"D35+D40","v":116191314},{"$f":"E35+E40","v":399155926},{"$f":"F35+F40","v":405878137.20999992},{"$f":"G35+G40","v":399155926}]
[]
["NET ASSETS",2,{"$f":"C26-C41","v":2856305409.8899999},{"$f":"D26-D41","v":3739822686},{"$f":"E26-E41","v":3348042321},{"$f":"F26-F41","v":2999913055.0000005},{"$f":"G26-G41","v":3348042321}]
[]
["COMMUNITY WEALTH/EQUITY"]
["Accumulated Surplus/(Deficit)",null,2856305409.8900003,3516524103,3088472378,2999913055,3088472378]
["Reserves",null,0,0,0,0,0]
["TOTAL COMMUNITY WEALTH/EQUITY",2,{"$f":"SUM(C46:C47)","v":2856305409.8900003},{"$f":"SUM(D46:D47)","v":3516524103},{"$f":"SUM(E46:E47)","v":3088472378},{"$f":"SUM(F46:F47)","v":2999913055},{"$f":"SUM(G46:G47)","v":3088472378}]
[{"$f":"head27a","v":"References"}]
["1. Material variances to be explained in Table SC1"]
["2. Net assets must balance with Total Community Wealth/Equity"]
[]
[]
["check balance",null,{"$f":"C43-C48","v":0},{"$f":"D43-D48","v":223298583},{"$f":"E43-E48","v":259569943},{"$f":"F43-F48","v":0},{"$f":"G43-G48","v":259569943}]

{"sheet":"C7-CFlow","index":15,"n_rows":43,"n_cols":11,"rows_kept":43,"cut":false,"hidden":false,"merged":[[1,0,2,0],[1,1,2,1],[0,0,0,10]]}
[{"$f":"muni& \" - \"&S71F& \" - \"&date","v":"NW375 Moses Kotane - Table C7 Monthly Budget Statement - Cash Flow  - M07 January"}]
[{"$f":"desc","v":"Description"},{"$f":"head27","v":"Ref"},{"$f":"Head1","v":"2019/20"},{"$f":"Head2","v":"Budget Year 2020/21"}]
[null,null,{"$f":"Head5","v":"Audited Outcome"},{"$f":"Head6","v":"Original Budget"},{"$f":"Head7","v":"Adjusted Budget"},{"$f":"Head38","v":"Monthly actual"},{"$f":"Head39","v":"YearTD actual"},{"$f":"Head40","v":"YearTD budget"},{"$f":"Head41","v":"YTD variance"},{"$f":"Head41","v":"YTD variance"},{"$f":"Head8","v":"Full Year Forecast"}]
["R thousands",1,null,null,null,null,null,null,null,"%"]
["CASH FLOW FROM OPERATING ACTIVITIES"]
["Receipts"]
["Property rates",null,0,0,71063746,6056968.1600000001,48215932.82,41453851.810000002,{"$f":"G7-H7","v":6762081.0099999979},{"$f":"IF(I7=0,\"\",I7/H7)","v":0.16312310472361863},71063746]
["Service charges",null,0,0,68734345,3656003.33,17788117.850000001,40095034.560000002,-22306916.710000001,{"$f":"IF(I8=0,\"\",I8/H8)","v":-0.55635110319256453},68734345]
["Other revenue",null,0,0,7725000,-23496321.469999999,261447845.30000001,4506250,256941595.30000001,{"$f":"IF(I9=0,\"\",I9/H9)","v":57.018939317614425},7725000]
["Transfers and Subsidies - Operational",null,0,0,550339767,0,766000,321031530.75,-320265530.75,{"$f":"IF(I10=0,\"\",I10/H10)","v":-0.9976139415396037},550339767]
["Transfers and Subsidies - Capital",null,0,0,202495203,0,86112160.109999999,118122201.75,-32010041.640000001,{"$f":"IF(I11=0,\"\",I11/H11)","v":-0.270990898965359},202495203]
["Interest",null,0,0,0,26429.72,935249.12,0,935249.12,{"$error":"#DIV/0!"},0]
["Dividends",null,null,null,null,null,null,null,0,""]
["Payments"]
["Suppliers and employees",null,0,0,-896256847,-27144955.23,-194551559.43000001,-522816494.13,{"$f":"H15-G15","v":-328264934.69999999},0.62787792348872573,-896256847]
["Finance charges",null,0,0,-3043808,0,0,-1775554.69,{"$f":"H16-G16","v":-1775554.69},1,-3043808]
["Transfers and Grants",null,null,null,null,null,null,null,{"$f":"H17-G17","v":0},""]
["NET CASH FROM/(USED) OPERATING ACTIVITIES",null,{"$f":"SUM(C7:C13)+SUM(C15:C17)","v":0},0,1057406,-40901875.489999995,220713745.77000004,616820.05000001192,{"$f":"H18-G18","v":-220096925.72000003},-356.82518056926938,{"$f":"SUM(K7:K13)+SUM(K15:K17)","v":1057406}]
[]
["CASH FLOWS FROM INVESTING ACTIVITIES"]
["Receipts"]
["Proceeds on disposal of PPE",null,null,null,null,null,null,null,{"$f":"G22-H22","v":0},{"$f":"IF(I22=0,\"\",I22/H22)","v":""}]
[]
["Decrease (increase) in non-current receivables",null,0,0,0,0,0,0,{"$f":"G24-H24","v":0},"",0]
["Decrease (increase) in non-current investments",null,0,0,0,0,0,0,{"$f":"G25-H25","v":0},"",0]
["Payments"]
["Capital assets",null,0,0,0,-6904946.1900000004,-47713765.590000004,0,{"$f":"H27-G27","v":47713765.590000004},{"$error":"#DIV/0!"},0]
["NET CASH FROM/(USED) INVESTING ACTIVITIES",null,{"$f":"SUM(C22:C25)+C27","v":0},{"$f":"SUM(D22:D25)+D27","v":0},0,-6904946.1900000004,-47713765.590000004,0,{"$f":"H28-G28","v":47713765.590000004},{"$error":"#DIV/0!"},{"$f":"SUM(K22:K25)+K27","v":0}]
[]
["CASH FLOWS FROM FINANCING ACTIVITIES"]
["Receipts"]
["Short term loans",null,null,null,null,null,null,null,{"$f":"G32-H32","v":0},{"$f":"IF(I32=0,\"\",I32/H32)","v":""}]
["Borrowing long term/refinancing",null,null,null,null,null,null,null,{"$f":"G33-H33","v":0},""]
["Increase (decrease) in consumer deposits",null,-15500,0,-15500,-1722.22,-1722.22,-6888.88,{"$f":"G34-H34","v":5166.66},-0.75,-15500]
["Payments",null,null,null,null,null,null,null,null,""]
["Repayment of borrowing",null,-6166346.4900000002,0,-2800000,0,-2648778.59,-1244444.32,{"$f":"H36-G36","v":1404334.2699999998},-1.1284830083840149,-2800000]
["NET CASH FROM/(USED) FINANCING ACTIVITIES",null,{"$f":"SUM(C32:C34)+C36","v":-6181846.4900000002},0,-2815500,-1722.22,-2650500.81,-1251333.2,{"$f":"H37-G37","v":1399167.61},-1.1181415229772536,{"$f":"SUM(K32:K34)+K36","v":-2815500}]
[]
["NET INCREASE/ (DECREASE) IN CASH HELD",null,{"$f":"C18+C28+C37","v":-6181846.4900000002},0,-1758094,-47808543.899999991,170349479.37000003,-634513.14999998803,null,null,{"$f":"K18+K28+K37","v":-1758094}]
["Cash/cash equivalents at beginning:",null,64673261.289999999,19040753,46655855,null,48780650.810000002]
["Cash/cash equivalents at month/year end:",null,{"$f":"C39+C40","v":58491414.799999997},{"$f":"D39+D40","v":19040753},{"$f":"E39+E40","v":44897761},null,{"$f":"G39+G40","v":219130130.18000004},{"$f":"H39+H40","v":-634513.14999998803},null,null,{"$f":"K39+K40","v":-1758094}]
["References"]
["1. Material variances to be explained in Table SC1"]

{"sheet":"SC1","index":16,"n_rows":47,"n_cols":5,"rows_kept":47,"cut":false,"hidden":false,"merged":[[1,0,2,0],[1,1,2,1],[0,0,0,4]]}
[{"$f":"muni& \" - \"&S71G& \" - \"&date","v":"NW375 Moses Kotane - Supporting Table SC1 Material variance explanations  - M07 January"}]
[{"$f":"head27","v":"Ref"},{"$f":"desc","v":"Description"}]
[null,null,"Variance","Reasons for material deviations","Remedial or corrective steps/remarks"]
[null,"R thousands"]
[1,{"$f":"'C4-FinPerf RE'!A5","v":"Revenue By Source"}]
[null,"Variances was not Calculated"]
[]
[]
[]
[2,{"$f":"'C4-FinPerf RE'!A24","v":"Expenditure By Type"}]
[null,"Variances was not Calculated"]
[]
[]
[]
[3,{"$f":"RIGHT('C5-Capex'!A40,19)","v":"Capital Expenditure"}]
[null,"Variances was not Calculated"]
[]
[]
[]
[4,"Financial Position"]
[null,"Variances was not Calculated"]
[]
[]
[]
[5,"Cash Flow"]
[]
[]
[]
[]
[6,"Measureable performance"]
[]
[]
[]
[]
[7,"Municipal Entities"]
[]
[]
[]
[]
[]
[{"$f":"head27a","v":"References"}]
["1. Revenue for each source, vote and standard classification"]
["2. Expenditure for each type, vote and standard classification"]
["3. Capital expenditure for each vote and standard classification"]
["4. Explain any material variances between the annual budget and the expected financial position based on current trends"]
["5. Cash receipts by source and cash payments by type where not explained under revenue and expenditure"]
["6. For Sept, Dec, Mar and Jun statements explain any material variances in achievement of measurable performance objectives"]

{"sheet":"SC2","index":17,"n_rows":65,"n_cols":8,"rows_kept":65,"cut":false,"hidden":false,"merged":[[1,0,2,0],[1,1,2,1],[1,2,2,2],[0,0,0,7]]}
[{"$f":"muni& \" - \"&S71H& \" - \"&Head57","v":"NW375 Moses Kotane - Supporting Table SC2 Monthly Budget Statement - performance indicators   - M07 January"}]
["Description of financial indicator","Basis of calculation",{"$f":"head27","v":"Ref"},{"$f":"Head1","v":"2019/20"},{"$f":"Head2","v":"Budget Year 2020/21"}]
[null,null,null,{"$f":"Head5","v":"Audited Outcome"},{"$f":"Head6","v":"Original Budget"},{"$f":"Head7","v":"Adjusted Budget"},{"$f":"Head39","v":"YearTD actual"},{"$f":"Head8","v":"Full Year Forecast"}]
[]
["Borrowing Management"]
[]
["Capital Charges to Operating Expenditure","Interest & principal paid/Operating Expenditure",null,{"$f":"IF(ISERROR((D42-D43)/D45),0,((D42-D43)/D45))","v":-8.1386616704503991E-4},{"$f":"IF(ISERROR((E42+E44)/E45),0,((E42+E44)/E45))","v":0.15970848590824863},{"$f":"IF(ISERROR((F42+F44)/F45),0,((F42+F44)/F45))","v":0.14889535091239012},{"$f":"IF(ISERROR((G42+G44)/G45),0,((G42+G44)/G45))","v":3.080030004236112E-3},{"$f":"IF(ISERROR((H42+H44)/H45),0,((H42+H44)/H45))","v":3.038262123070827E-2}]
["Borrowed funding of 'own' capital expenditure","Borrowings/Capital expenditure excl. transfers and grants",null,{"$f":"IF(ISERROR(D47/D46),0,(D47/D46))","v":0},{"$f":"IF(ISERROR(E47/E46),0,(E47/E46))","v":0},{"$f":"IF(ISERROR(F47/F46),0,(F47/F46))","v":0},{"$f":"IF(ISERROR(G47/G46),0,(G47/G46))","v":0},{"$f":"IF(ISERROR(H47/H46),0,(H47/H46))","v":0}]
["Safety of Capital"]
["Debt to Equity","Loans, Accounts Payable, Overdraft & Tax Provision/ Funds & Reserves",null,{"$f":"IF(ISERROR(D48/D49),0,(D48/D49))","v":0.11878257441071964},{"$f":"IF(ISERROR(E48/E49),0,(E48/E49))","v":2.4558910296199384E-2},{"$f":"IF(ISERROR(F48/F49),0,(F48/F49))","v":0.10797548729121255},{"$f":"IF(ISERROR(G48/G49),0,(G48/G49))","v":0.11376202741315782},{"$f":"IF(ISERROR(H48/H49),0,(H48/H49))","v":0.10797548729121255}]
["Gearing","Long Term Borrowing/ Funds & Reserves",null,{"$f":"IF(ISERROR(D51/D50),0,(D51/D50))","v":0},{"$f":"IF(ISERROR(E51/E50),0,(E51/E50))","v":0},{"$f":"IF(ISERROR(F51/F50),0,(F51/F50))","v":0},{"$f":"IF(ISERROR(G51/G50),0,(G51/G50))","v":0},{"$f":"IF(ISERROR(H51/H50),0,(H51/H50))","v":0}]
["Liquidity"]
["Current Ratio","Current assets/current liabilities",1,{"$f":"IF(ISERROR(D52/D53),0,(D52/D53))","v":0.51254753870707148},{"$f":"IF(ISERROR(E52/E53),0,(E52/E53))","v":1.9573839304323661},{"$f":"IF(ISERROR(F52/F53),0,(F52/F53))","v":1.2807334083108921},{"$f":"IF(ISERROR(G52/G53),0,(G52/G53))","v":0.90989158999841002},{"$f":"IF(ISERROR(H52/H53),0,(H52/H53))","v":1.2807334083108921}]
["Liquidity Ratio","Monetary Assets/Current Liabilities",null,{"$f":"IF(ISERROR(D54/D53),0,(D54/D53))","v":0.13034930268662656},{"$f":"IF(ISERROR(E54/E53),0,(E54/E53))","v":0.2204760542831338},{"$f":"IF(ISERROR(F54/F53),0,(F54/F53))","v":0.14807978031336408},{"$f":"IF(ISERROR(G54/G53),0,(G54/G53))","v":0.4044959441052946},{"$f":"IF(ISERROR(H54/H53),0,(H54/H53))","v":0.14807978031336408}]
["Revenue Management"]
["Annual Debtors Collection Rate \n(Payment Level %)","Last 12 Mths Receipts/ Last 12 Mths Billing"]
["Outstanding Debtors to Revenue","Total Outstanding Debtors to Annual Revenue",null,{"$f":"IF(ISERROR(D59/D55),0,(D59/D55))","v":0.16040291191158637},{"$f":"IF(ISERROR(E59/E55),0,(E59/E55))","v":0.16556981967077389},{"$f":"IF(ISERROR(F59/F55),0,(F59/F55))","v":0.42523109242619028},{"$f":"IF(ISERROR(G59/G55),0,(G59/G55))","v":0.2698266608532201},{"$f":"IF(ISERROR(H59/H55),0,(H59/H55))","v":0.42523109242619028}]
["Longstanding Debtors Recovered","Debtors > 12 Mths Recovered/Total Debtors > \n12 Months Old",null,{"$f":"IF(ISERROR(D64/D63),0,(D64/D63))","v":0},{"$f":"IF(ISERROR(E64/E63),0,(E64/E63))","v":0},{"$f":"IF(ISERROR(F64/F63),0,(F64/F63))","v":0},{"$f":"IF(ISERROR(G64/G63),0,(G64/G63))","v":0},{"$f":"IF(ISERROR(H64/H63),0,(H64/H63))","v":0}]
["Creditors Management"]
["Creditors System Efficiency","% of Creditors Paid Within Terms (within MFMA s 65(e))"]
["Funding of Provisions"]
["Percentage Of Provisions Not Funded","Unfunded Provisions/Total Provisions"]
["Other Indicators"]
["Electricity Distribution Losses","% Volume (units purchased and generated less units sold)/units purchased and generated",2]
["Water Distribution Losses","% Volume (units purchased and own source less units sold)/Total units purchased and own source",2]
["Employee costs","Employee costs/Total Revenue - capital revenue",null,{"$f":"IF(ISERROR(D40/D55),0,(D40/D55))","v":0.28514270159887017},{"$f":"IF(ISERROR(E40/E55),0,(E40/E55))","v":0.30924572123320765},{"$f":"IF(ISERROR(F40/F55),0,(F40/F55))","v":0.28392334636399513},{"$f":"IF(ISERROR(G40/G55),0,(G40/G55))","v":0.21193690627657374},{"$f":"IF(ISERROR(H40/H55),0,(H40/H55))","v":0.28392334636399513}]
["Repairs & Maintenance","R&M/Total Revenue - capital revenue",null,{"$f":"IF(ISERROR(D41/D55),0,(D41/D55))","v":5.5126524738056078E-2},{"$f":"IF(ISERROR(E41/E55),0,(E41/E55))","v":3.5602523706016916E-2},{"$f":"IF(ISERROR(F41/F55),0,(F41/F55))","v":3.9405058177848444E-2},{"$f":"IF(ISERROR(G41/G55),0,(G41/G55))","v":5.545130867414394E-2},{"$f":"IF(ISERROR(H41/H55),0,(H41/H55))","v":3.9405058177848444E-2}]
["Interest & Depreciation","I&D/Total Revenue - capital revenue",null,{"$f":"IF(ISERROR((D42+D44)/D55),0,((D42+D44)/D55))","v":0.18310699451204998},{"$f":"IF(ISERROR((E42+E44)/E55),0,((E42+E44)/E55))","v":0.15591476007692209},{"$f":"IF(ISERROR((F42+F44)/F55),0,((F42+F44)/F55))","v":0.14247023690765059},{"$f":"IF(ISERROR((G42+G44)/G55),0,((G42+G44)/G55))","v":2.4065117866466758E-3},{"$f":"IF(ISERROR((H42+H44)/H55),0,((H42+H44)/H55))","v":2.9071554068611428E-2}]
["IDP regulation financial viability indicators"]
["i. Debt coverage","(Total Operating Revenue - Operating Grants)/Debt service payments due within financial year)"]
["ii. O/S Service Debtors to Revenue","Total outstanding service debtors/annual revenue received for services"]
["iii. Cost coverage","(Available cash + Investments)/monthly fixed operational expenditure"]
["References"]
["1. Consumer debtors > 12 months old are excluded from current assets."]
["2. Material variances to be explained."]
[]
["Calculations"]
[{"$f":"'C6-FinPos'!A38","v":"Borrowing"},null,null,{"$f":"'C6-FinPos'!C38","v":0},{"$f":"'C6-FinPos'!D38","v":0},{"$f":"'C6-FinPos'!E38","v":0},{"$f":"'C6-FinPos'!F38","v":0},0]
["Total Assets",null,null,{"$f":"'C6-FinPos'!C26","v":3261261335.1199999},{"$f":"'C6-FinPos'!D26","v":3856014000},{"$f":"'C6-FinPos'!E26","v":3747198247},{"$f":"'C6-FinPos'!F26","v":3405791192.2100005},{"$f":"'C6-FinPos'!G26","v":3747198247}]
[{"$f":"'C4-FinPerf RE'!A25","v":"Employee related costs"},null,null,{"$f":"'C4-FinPerf RE'!C25","v":236924858.34999999},{"$f":"'C4-FinPerf RE'!D25","v":270831407},{"$f":"'C4-FinPerf RE'!E25","v":272119407},{"$f":"'C4-FinPerf RE'!G25","v":139705628.5},{"$f":"'C4-FinPerf RE'!K25","v":272119407}]
[{"$f":"A27","v":"Repairs & Maintenance"},null,null,45804588.339999996,31180000,37766817,36552670.630000003,37766817]
["Interest (finance charges)",null,null,{"$f":"'C4-FinPerf RE'!C29","v":5347470.47},{"$f":"'C4-FinPerf RE'!D29","v":3043808},{"$f":"'C4-FinPerf RE'!E29","v":3043808},{"$f":"'C4-FinPerf RE'!G29","v":1586336.46},{"$f":"'C4-FinPerf RE'!K29","v":3043808}]
["Principal paid",null,null,{"$f":"-'C7-CFlow'!C36","v":6166346.4900000002},{"$f":"-'C7-CFlow'!D36","v":0},{"$f":"-'C7-CFlow'!E36","v":2800000},{"$f":"-'C7-CFlow'!G36","v":2648778.59},{"$f":"-'C7-CFlow'!K36","v":2800000}]
["Depreciation",null,null,{"$f":"'C4-FinPerf RE'!C28","v":146795994.87},{"$f":"'C4-FinPerf RE'!D28","v":133503316},{"$f":"'C4-FinPerf RE'!E28","v":133503316},null,{"$f":"'C4-FinPerf RE'!K26","v":24819114}]
["Operating expenditure",null,null,{"$f":"'C4-FinPerf RE'!C36","v":1006155622.58},{"$f":"'C4-FinPerf RE'!D36","v":854977262},{"$f":"'C4-FinPerf RE'!E36","v":917067747},{"$f":"'C4-FinPerf RE'!G36","v":515039287.86999995},{"$f":"'C4-FinPerf RE'!K36","v":917067747}]
[{"$f":"'C5-Capex'!A40","v":"Total Capital Expenditure"},null,null,{"$f":"'C5-Capex'!C40","v":22910640.889999997},{"$f":"'C5-Capex'!D40","v":203495233},{"$f":"'C5-Capex'!E40","v":203495233},{"$f":"'C5-Capex'!G40","v":73187957.599999994},{"$f":"'C5-Capex'!K40","v":203495233}]
["Borrowed funding for capital",null,null,{"$f":"'C5-Capex'!C72","v":0},{"$f":"'C5-Capex'!D72","v":0},{"$f":"'C5-Capex'!E72","v":0},{"$f":"'C5-Capex'!G72","v":0},{"$f":"'C5-Capex'!K72","v":0}]
["Debt",null,null,{"$f":"'C6-FinPos'!C30+'C6-FinPos'!C31+'C6-FinPos'!C33+'C6-FinPos'!C38","v":339279309.89000005},{"$f":"'C6-FinPos'!D30+'C6-FinPos'!D31+'C6-FinPos'!D33+'C6-FinPos'!D38","v":86362000},{"$f":"'C6-FinPos'!E30+'C6-FinPos'!E31+'C6-FinPos'!E33+'C6-FinPos'!E38","v":333479310},{"$f":"'C6-FinPos'!F30+'C6-FinPos'!F31+'C6-FinPos'!F33+'C6-FinPos'!F38","v":341276191.19999999},{"$f":"'C6-FinPos'!G30+'C6-FinPos'!G31+'C6-FinPos'!G33+'C6-FinPos'!G38","v":333479310}]
["Equity",null,null,{"$f":"'C6-FinPos'!C48","v":2856305409.8900003},{"$f":"'C6-FinPos'!D48","v":3516524103},{"$f":"'C6-FinPos'!E48","v":3088472378},{"$f":"'C6-FinPos'!F48","v":2999913055},{"$f":"'C6-FinPos'!G48","v":3088472378}]
[{"$f":"'C6-FinPos'!A47","v":"Reserves"},null,null,{"$f":"'C6-FinPos'!C47","v":0},{"$f":"'C6-FinPos'!D47","v":0},{"$f":"'C6-FinPos'!E47","v":0},{"$f":"'C6-FinPos'!F47","v":0},{"$f":"'C6-FinPos'!G47","v":0}]
[{"$f":"'C6-FinPos'!A38","v":"Borrowing"},null,null,{"$f":"'C6-FinPos'!C38","v":0},{"$f":"'C6-FinPos'!D38","v":0},{"$f":"'C6-FinPos'!E38","v":0},{"$f":"'C6-FinPos'!F38","v":0},{"$f":"'C6-FinPos'!G38","v":0}]
[{"$f":"'C6-FinPos'!A6","v":"Current assets"},null,null,{"$f":"'C6-FinPos'!C13","v":191810788.34999999},{"$f":"'C6-FinPos'!D13","v":169043591},{"$f":"'C6-FinPos'!E13","v":471860917},{"$f":"'C6-FinPos'!F13","v":341029598.84000003},{"$f":"'C6-FinPos'!G13","v":471860917}]
[{"$f":"'C6-FinPos'!A29","v":"Current liabilities"},null,null,{"$f":"'C6-FinPos'!C35","v":374230239.86000001},{"$f":"'C6-FinPos'!D35","v":86362000},{"$f":"'C6-FinPos'!E35","v":368430240},{"$f":"'C6-FinPos'!F35","v":374802451.83999991},{"$f":"'C6-FinPos'!G35","v":368430240}]
["Monetary assets",null,null,{"$f":"'C6-FinPos'!C7+'C6-FinPos'!C8","v":48780650.810000002},{"$f":"'C6-FinPos'!D7+'C6-FinPos'!D8","v":19040753},{"$f":"'C6-FinPos'!E7+'C6-FinPos'!E8","v":54557069},{"$f":"'C6-FinPos'!F7+'C6-FinPos'!F8","v":151606071.60999998},{"$f":"'C6-FinPos'!G7+'C6-FinPos'!G8","v":54557069}]
[{"$f":"'C4-FinPerf RE'!A22","v":"Total Revenue (excluding capital transfers and contributions)"},null,null,{"$f":"'C4-FinPerf RE'!C22","v":830899255.08000016},{"$f":"'C4-FinPerf RE'!D22","v":875780612},{"$f":"'C4-FinPerf RE'!E22","v":958425612},{"$f":"'C4-FinPerf RE'!G22","v":659184994.98000002},{"$f":"'C4-FinPerf RE'!K22","v":958425612}]
[{"$f":"'C4-FinPerf RE'!A19","v":"Transfers and subsidies"},null,null,{"$f":"'C4-FinPerf RE'!C19","v":434445420.41000003},{"$f":"'C4-FinPerf RE'!D19","v":467694767},{"$f":"'C4-FinPerf RE'!E19","v":550339767},{"$f":"'C4-FinPerf RE'!G19","v":429726279.18000001},{"$f":"'C4-FinPerf RE'!K19","v":550339767}]
[{"$f":"'C4-FinPerf RE'!A39","v":"Transfers and subsidies - capital (monetary allocations) (National / Provincial and District)"},null,null,{"$f":"'C4-FinPerf RE'!C39","v":68075621.780000001},{"$f":"'C4-FinPerf RE'!D39","v":202495233},{"$f":"'C4-FinPerf RE'!E39","v":202495233},{"$f":"'C4-FinPerf RE'!G39","v":0},{"$f":"'C4-FinPerf RE'!K39","v":202495233}]
["Debt service payments",null,null,{"$f":"'C7-CFlow'!C12+'C7-CFlow'!C36","v":-6166346.4900000002},{"$f":"'C7-CFlow'!D12+'C7-CFlow'!D36","v":0},{"$f":"'C7-CFlow'!E12+'C7-CFlow'!E36","v":-2800000},{"$f":"'C7-CFlow'!G16+'C7-CFlow'!G36","v":-2648778.59},{"$f":"'C7-CFlow'!K16+'C7-CFlow'!K36","v":-5843808}]
["Outstanding debtors (receivables)",null,null,{"$f":"'C6-FinPos'!C9+'C6-FinPos'!C10+'C6-FinPos'!C11+'C6-FinPos'!C16","v":133278660.02},{"$f":"'C6-FinPos'!D9+'C6-FinPos'!D10+'C6-FinPos'!D11+'C6-FinPos'!D16","v":145002838},{"$f":"'C6-FinPos'!E9+'C6-FinPos'!E10+'C6-FinPos'!E11+'C6-FinPos'!E16","v":407552370},{"$f":"'C6-FinPos'!F9+'C6-FinPos'!F10+'C6-FinPos'!F11+'C6-FinPos'!F16","v":177865686.08000004},{"$f":"'C6-FinPos'!G9+'C6-FinPos'!G10+'C6-FinPos'!G11+'C6-FinPos'!G16","v":407552370}]
["Annual services revenue",null,null,{"$f":"SUM('C4-FinPerf RE'!C7:C11)","v":177042111.14000002},{"$f":"SUM('C4-FinPerf RE'!D7:D11)","v":186492720},{"$f":"SUM('C4-FinPerf RE'!E7:E11)","v":186492720},{"$f":"SUM('C4-FinPerf RE'!G7:G11)","v":104428086.98}]
["Cash + investments","Including LT investments",null,{"$f":"'C6-FinPos'!C7+'C6-FinPos'!C8+'C6-FinPos'!C17-'C6-FinPos'!C30","v":48780650.810000002},{"$f":"'C6-FinPos'!D7+'C6-FinPos'!D8+'C6-FinPos'!D17-'C6-FinPos'!D30","v":19040753},{"$f":"'C6-FinPos'!E7+'C6-FinPos'!E8+'C6-FinPos'!E17-'C6-FinPos'!E30","v":54557069},{"$f":"'C6-FinPos'!F7+'C6-FinPos'!F8+'C6-FinPos'!F17-'C6-FinPos'!F30","v":151606071.60999998},{"$f":"'C6-FinPos'!G7+'C6-FinPos'!G8+'C6-FinPos'!G17-'C6-FinPos'!G30","v":54557069}]
["Fixed operational expend. (monthly)"]
["Longstanding debtors outstanding",null,null,{"$f":"'C6-FinPos'!C16","v":0},{"$f":"'C6-FinPos'!D16","v":0},{"$f":"'C6-FinPos'!E16","v":0},{"$f":"'C6-FinPos'!F16","v":0},{"$f":"'C6-FinPos'!G16","v":0}]
["Longstanding debtors recovered"]
["Attorney collections"]

{"sheet":"SC3","index":18,"n_rows":27,"n_cols":14,"rows_kept":27,"cut":false,"hidden":false,"merged":[[0,0,0,12],[1,2,1,13]]}
[{"$f":"muni& \" - \"&S71I& \" - \"&Head57","v":"NW375 Moses Kotane - Supporting Table SC3 Monthly Budget Statement - aged debtors - M07 January"}]
[{"$f":"desc","v":"Description"},null,{"$f":"Head2","v":"Budget Year 2020/21"}]
["R thousands","NT Code","0-30 Days","31-60 Days","61-90 Days","91-120 Days","121-150 Dys","151-180 Dys","181 Dys-1 Yr","Over 1Yr","Total","Total \nover 90 days","Actual Bad Debts Written Off against Debtors","Impairment - Bad Debts i.t.o Council Policy"]
["Debtors Age Analysis By Income Source"]
["Trade and Other Receivables from Exchange Transactions - Water",1200,41310731,17393492,16990538,18407181,13324805,11917898,86873561,452926289,{"$f":"SUM(C5:J5)","v":659144495},{"$f":"SUM(F5:J5)","v":583449734},0,0]
["Trade and Other Receivables from Exchange Transactions - Electricity",1300,null,null,null,null,null,null,null,null,{"$f":"SUM(C6:J6)","v":0},{"$f":"SUM(F6:J6)","v":0}]
["Receivables from Non-exchange Transactions - Property Rates",1400,19906434,8861798,8687435,8295098,8951950,7137524,34674636,186793058,{"$f":"SUM(C7:J7)","v":283307933},245852266,0,0]
["Receivables from Exchange Transactions - Waste Water Management",1500,594947,219132,365335,316139,305758,243632,1230552,8149332,11424827,10245413,0,0]
["Receivables from Exchange Transactions - Waste Management",1600,2067814,1032051,1032794,1032021,1032814,1029282,5605742,58047029,70879547,{"$f":"SUM(F9:J9)","v":66746888},0,0]
["Receivables from Exchange Transactions - Property Rental Debtors",1700,null,null,null,null,null,null,null,null,0,{"$f":"SUM(F10:J10)","v":0}]
["Interest on Arrear Debtor Accounts",1810,11224767,5381265,5268582,5266063,5095514,4946968,33201158,247640125,318024442,296149828,0,0]
["Recoverable unauthorised, irregular, fruitless and wasteful expenditure",1820,null,null,null,null,null,null,null,null,0,0]
["Other",1900,297422,89422,75022,86038,68373,68828,893031,35727956,37306092,{"$f":"SUM(F13:J13)","v":36844226},0,0]
["Total By Income Source",2000,{"$f":"SUM(C5:C13)","v":75402115},32977160,32419706,33402540,28779214,25344132,162478680,989283789,1380087336,{"$f":"SUM(L5:L13)","v":1239288355},0,0]
[{"$f":"Head1&\" - totals only\"","v":"2019/20 - totals only"},null,null,null,null,null,null,null,null,null,{"$f":"SUM(C15:J15)","v":0},{"$f":"SUM(F15:J15)","v":0}]
["Debtors Age Analysis By Customer Group"]
["Organs of State",2200,12726682,5507880,5427054,5371609,5359443,5236445,27593517,127364964,{"$f":"SUM(C17:J17)","v":194587594},{"$f":"SUM(F17:J17)","v":170925978},0,0]
["Commercial",2300,23990029,9402108,9287547,9352367,8575447,5759788,22689351,171059010,{"$f":"SUM(C18:J18)","v":260115647},{"$f":"SUM(F18:J18)","v":217435963},0,0]
["Households",2400,38394025,17981485,17634466,18593174,14776466,14280079,111499218,684534024,{"$f":"SUM(C19:J19)","v":917692937},{"$f":"SUM(F19:J19)","v":843682961},0,0]
["Other",2500,291379,85687,70639,85390,67858,67820,696594,6325791,{"$f":"SUM(C20:J20)","v":7691158},{"$f":"SUM(F20:J20)","v":7243453},0,0]
["Total By Customer Group",2600,{"$f":"SUM(C17:C20)","v":75402115},32977160,32419706,33402540,28779214,25344132,162478680,{"$f":"SUM(J17:J20)","v":989283789},{"$f":"SUM(K17:K20)","v":1380087336},{"$f":"SUM(L17:L20)","v":1239288355},{"$f":"SUM(M17:M20)","v":0},{"$f":"SUM(N17:N20)","v":0}]
["Notes"]
["Material increases in value of debtors' categories compared to previous month to be explained"]
["Bad debts = amounts actually written off in the month"]
["Total by Income Source must reconcile with Total by Customer Group"]
[null,null,{"$f":"C14-C21","v":0},{"$f":"D14-D21","v":0},{"$f":"E14-E21","v":0},0,0,0,0,{"$f":"J14-J21","v":0},0]
[null,null,{"$f":"IF(C26=0,\"\",\"MUST AGREE\")","v":""},{"$f":"IF(D26=0,\"\",\"MUST AGREE\")","v":""},"","","","","","",""]

{"sheet":"SC4","index":19,"n_rows":17,"n_cols":12,"rows_kept":17,"cut":false,"hidden":false,"merged":[[1,11,3,11],[0,0,0,10],[2,8,3,8],[2,9,3,9],[2,10,3,10],[2,4,3,4],[2,5,3,5],[2,6,3,6],[2,7,3,7],[1,0,2,0],[1,1,3,1],[2,2,3,2],[2,3,3,3]]}
[{"$f":"muni& \" - \"&S71J& \" - \"&Head57","v":"NW375 Moses Kotane - Supporting Table SC4 Monthly Budget Statement - aged creditors  - M07 January"}]
[{"$f":"desc","v":"Description"},"NT Code",{"$f":"Head2","v":"Budget Year 2020/21"},null,null,null,null,null,null,null,null,"Prior year totals for chart (same period)"]
[null,null,"0 - \n30 Days","31 - \n60 Days","61 - \n90 Days","91 - \n120 Days","121 - \n150 Days","151 - \n180 Days","181 Days -\n1 Year","Over 1\nYear","Total\n"]
["R thousands"]
["Creditors Age Analysis By Customer Type"]
["Bulk Electricity","0100",2222350.38,61881.5,1740603.85,4024835.73,0,0,0,0,{"$f":"SUM(C6:J6)","v":8049671.46}]
["Bulk Water","0200",null,null,null,null,null,null,null,null,{"$f":"SUM(C7:J7)","v":0}]
["PAYE deductions","0300",null,null,null,null,null,null,null,null,0]
["VAT (output less input)","0400",null,null,null,null,null,null,null,null,0]
["Pensions / Retirement deductions","0500",null,null,null,null,null,null,null,null,0]
["Loan repayments","0600",null,null,null,null,null,null,null,null,0]
["Trade Creditors","0700",null,null,null,null,null,null,null,null,0,4287261.84]
["Auditor General","0800",null,null,null,null,null,null,null,null,0]
["Other","0900",null,null,null,null,null,null,null,null,{"$f":"SUM(C14:J14)","v":0}]
["Total By Customer Type",1000,{"$f":"SUM(C6:C14)","v":2222350.38},{"$f":"SUM(D6:D14)","v":61881.5},1740603.85,4024835.73,0,0,0,0,{"$f":"SUM(K6:K14)","v":8049671.46},{"$f":"SUM(L6:L14)","v":4287261.84}]
["Notes"]
["Material increases in value of creditors' categories compared to previous month to be explained"]

{"sheet":"SC5","index":20,"n_rows":22,"n_cols":15,"rows_kept":22,"cut":false,"hidden":false,"merged":[[2,10,2,14],[0,0,0,9],[1,1,2,1],[1,3,2,3],[1,9,2,9]]}
[{"$f":"muni& \" - \"&S71K& \" - \"&Head57","v":"NW375 Moses Kotane - Supporting Table SC5 Monthly Budget Statement - investment portfolio  - M07 January"}]
["Investments by maturity\nName of institution & investment ID","Ref","Period of Investment","Type of Investment","Capital Guarantee\n(Yes/ No)","Variable or Fixed interest rate","Interest Rate ᶟ","Commission Paid (Rands)","Commission Recipient","Expiry date of investment","Opening balance","Interest to be realised","Partial / Premature Withdrawal (4)","Investment Top Up","Closing Balance"]
["R thousands",null,"Yrs/Months"]
["Municipality"]
[null,null,null,null,null,null,null,null,null,null,null,null,null,null,{"$f":"SUM(K5:N5)","v":0}]
["Municipality sub-total",null,null,null,null,null,null,null,null,null,{"$f":"SUM(K5:K5)","v":0},null,{"$f":"SUM(M5:M5)","v":0},{"$f":"SUM(N5:N5)","v":0},{"$f":"SUM(O5:O5)","v":0}]
[]
["Entities"]
[null,null,null,null,null,null,null,null,null,null,null,null,null,null,{"$f":"SUM(K9:N9)","v":0}]
[null,null,null,null,null,null,null,null,null,null,null,null,null,null,0]
[null,null,null,null,null,null,null,null,null,null,null,null,null,null,0]
[null,null,null,null,null,null,null,null,null,null,null,null,null,null,0]
[null,null,null,null,null,null,null,null,null,null,null,null,null,null,0]
[null,null,null,null,null,null,null,null,null,null,null,null,null,null,0]
[null,null,null,null,null,null,null,null,null,null,null,null,null,null,0]
["Entities sub-total",null,null,null,null,null,null,null,null,null,{"$f":"SUM(K9:K15)","v":0},null,{"$f":"SUM(M9:M15)","v":0},{"$f":"SUM(N9:N15)","v":0},{"$f":"SUM(O9:O15)","v":0}]
[]
["TOTAL INVESTMENTS AND INTEREST",2,null,null,null,null,null,null,null,null,{"$f":"K6+K16","v":0},null,{"$f":"M6+M16","v":0},{"$f":"N6+N16","v":0},{"$f":"O6+O16","v":0}]
[{"$f":"head27a","v":"References"}]
["2. List investments in expiry date order"]
["3. If 'variable' is selected in column F, input interest rate range"]
["4. Withdrawals to be entered as negative"]

{"sheet":"SC6","index":21,"n_rows":51,"n_cols":11,"rows_kept":51,"cut":false,"hidden":false,"merged":[[1,0,2,0],[1,1,2,1],[0,0,0,10]]}
[{"$f":"muni& \" - \"&S71L& \" - \"&Head57","v":"NW375 Moses Kotane - Supporting Table SC6 Monthly Budget Statement - transfers and grant receipts  - M07 January"}]
[{"$f":"desc","v":"Description"},{"$f":"head27","v":"Ref"},{"$f":"Head1","v":"2019/20"},{"$f":"Head2","v":"Budget Year 2020/21"}]
[null,null,{"$f":"Head5","v":"Audited Outcome"},{"$f":"Head6","v":"Original Budget"},{"$f":"Head7","v":"Adjusted Budget"},{"$f":"Head38","v":"Monthly actual"},{"$f":"Head39","v":"YearTD actual"},{"$f":"Head40","v":"YearTD budget"},{"$f":"Head41","v":"YTD variance"},{"$f":"Head41","v":"YTD variance"},{"$f":"Head8","v":"Full Year Forecast"}]
["R thousands",null,null,null,null,null,null,null,null,"%"]
["RECEIPTS:","1,2"]
[]
["Operating Transfers and Grants"]
["National Government:",null,{"$f":"SUM(C9:C16)","v":433799018.87},467694767,550339767,0,429726279.18000001,314144427,{"$f":"G8-H8","v":115581852.18000001},{"$f":"IF(H8=0,\"\",I8/H8)","v":0.36792583998314893},{"$f":"SUM(K9:K16)","v":550339767}]
["Community Library",null,0,0,0,0,0,0,0,"",0]
["Equitable Share",null,426929350.69999999,459989000,542634000,0,427397000,309649405,117747595,0.38026100841369292,542634000]
["Expanded Public Works Programme Integrated Grant",null,1559133.26,1827000,1827000,0,1096370.07,1065750,30620.070000000065,2.8731006333567972E-2,1827000]
["Local Government Financial Management Grant",null,1700000,1700000,1700000,0,1232909.1100000001,991662,241247.1100000001,0.24327554146473304,1700000]
["Municipal Disaster Relief Grant",null,268000,0,0,0,0,0,0,"",0]
["Municipal Infrastructure Grant",3,3342534.91,4178767,4178767,0,0,2437610,-2437610,-1,4178767]
["Water Services Infrastructure Grant",null,0,0,0,0,0,0,0,"",0]
["Water Services Operating Subsidy Grant [Schedule 5B]",null,0,0,0,0,0,0,0,"",0]
["Other transfers and grants [insert description]",null,null,null,null,null,null,null,{"$f":"G17-H17","v":0},{"$f":"IF(I17=0,\"\",I17/H17)","v":""}]
["Provincial Government:",null,{"$f":"SUM(C19:C20)","v":0},0,0,0,0,0,{"$f":"G18-H18","v":0},{"$f":"IF(H18=0,\"\",I18/H18)","v":""},{"$f":"SUM(K19:K20)","v":0}]
["Libraries; Archives and Museums",null,0,0,0,0,0,0,{"$f":"G19-H19","v":0},{"$f":"IF(H19=0,\"\",I19/H19)","v":""},0]
["Specify (Add grant description)",null,0,0,0,0,0,0,{"$f":"G20-H20","v":0},{"$f":"IF(H20=0,\"\",I20/H20)","v":""},0]
["Other transfers and grants [insert description]",null,null,null,null,null,null,null,{"$f":"G21-H21","v":0},""]
["District Municipality:",null,{"$f":"SUM(C23:C23)","v":0},0,0,0,0,0,0,"",{"$f":"SUM(K23:K23)","v":0}]
["[insert description]",null,null,null,null,null,null,null,0,""]
["Other grant providers:",null,{"$f":"SUM(C25:C25)","v":646401.54},0,0,0,0,0,{"$f":"G24-H24","v":0},{"$f":"IF(H24=0,\"\",I24/H24)","v":""},{"$f":"SUM(K25:K25)","v":0}]
["National Library South Africa",null,646401.54,0,0,0,0,0,{"$f":"G25-H25","v":0},{"$f":"IF(H25=0,\"\",I25/H25)","v":""},0]
["Total Operating Transfers and Grants",5,{"$f":"C8+C18+C22+C24","v":434445420.41000003},467694767,550339767,0,429726279.18000001,314144427,115581852.18000001,0.36792583998314893,{"$f":"K8+K18+K22+K24","v":550339767}]
[]
["Capital Transfers and Grants"]
[{"$f":"A8","v":"National Government:"},null,{"$f":"SUM(C30:C32)","v":68075621.780000001},202495233,202495233,0,0,118122200,{"$f":"G29-H29","v":-118122200},{"$f":"IF(H29=0,\"\",I29/H29)","v":-1},{"$f":"SUM(K30:K32)","v":202495233}]
["Municipal Infrastructure Grant",null,27965384.120000001,144470233,144470233,0,0,84274288,-84274288,-1,144470233]
["Municipal Water Infrastructure Grant  ",null,0,0,0,0,0,0,0,"",0]
["Water Services Infrastructure Grant  ",null,40110237.659999996,58025000,58025000,0,0,33847912,-33847912,-1,58025000]
[{"$f":"A18","v":"Provincial Government:"},null,{"$f":"SUM(C34:C35)","v":0},0,0,0,0,0,0,"",{"$f":"SUM(K34:K35)","v":0}]
["Specify (Add grant description)",null,0,0,0,0,0,0,0,"",0]
["Waste Water Infrastructure",null,0,0,0,0,0,0,0,"",0]
[{"$f":"A22","v":"District Municipality:"},null,{"$f":"SUM(C37:C37)","v":0},0,0,0,0,0,{"$f":"G36-H36","v":0},{"$f":"IF(I36=0,\"\",I36/H36)","v":""},{"$f":"SUM(K37:K37)","v":0}]
["[insert description]",null,null,null,null,null,null,null,0,""]
[{"$f":"A24","v":"Other grant providers:"},null,{"$f":"SUM(C39:C42)","v":96552077.219999999},0,0,0,0,0,{"$f":"G38-H38","v":0},{"$f":"IF(H38=0,\"\",I38/H38)","v":""},{"$f":"SUM(K39:K42)","v":0}]
["[insert description]",null,null,null,null,null,null,null,0,{"$f":"IF(I39=0,\"\",I39/H39)","v":""}]
["Municipal Infrastructure Investment Unit",null,91811117.760000005,0,0,0,0,0,{"$f":"G40-H40","v":0},{"$f":"IF(H40=0,\"\",I40/H40)","v":""},0]
["National Small Business Council",null,4740959.46,0,0,0,0,0,{"$f":"G41-H41","v":0},{"$f":"IF(H41=0,\"\",I41/H41)","v":""},0]
["Registration of Deeds Trade Account",null,0,0,0,0,0,0,{"$f":"G42-H42","v":0},{"$f":"IF(H42=0,\"\",I42/H42)","v":""},0]
["Total Capital Transfers and Grants",5,{"$f":"C29+C33+C36+C38","v":164627699},202495233,202495233,0,0,118122200,-118122200,-1,{"$f":"K29+K33+K36+K38","v":202495233}]
[]
["TOTAL RECEIPTS OF TRANSFERS & GRANTS",5,{"$f":"C26+C43","v":599073119.41000009},670190000,752835000,0,429726279.18000001,432266627,-2540347.8199999928,-5.8768076490901362E-3,{"$f":"K26+K43","v":752835000}]
[{"$f":"head27a","v":"References"}]
["1. Each grant is listed by name as gazetted together with the name of the transferring department or municipality, donor or other organisation"]
["2. Grant expenditure must be separately listed for each grant received"]
["3. Replacement of RSC levies"]
["4. Housing subsidies for housing where ownership transferred"]
["5. Total recurrent/capital grants and subsidies must reconcile to the 'Financial Performance' Statement"]

{"sheet":"SC7(1)","index":22,"n_rows":36,"n_cols":11,"rows_kept":36,"cut":false,"hidden":false,"merged":[[1,0,2,0],[1,1,2,1],[0,0,0,10]]}
[{"$f":"muni& \" - \"&S71M& \" - \"&Head57","v":"NW375 Moses Kotane - Supporting Table SC7(1) Monthly Budget Statement - transfers and grant expenditure  - M07 January"}]
[{"$f":"desc","v":"Description"},{"$f":"head27","v":"Ref"},{"$f":"Head1","v":"2019/20"},{"$f":"Head2","v":"Budget Year 2020/21"}]
[null,null,{"$f":"Head5","v":"Audited Outcome"},{"$f":"Head6","v":"Original Budget"},{"$f":"Head7","v":"Adjusted Budget"},{"$f":"Head38","v":"Monthly actual"},{"$f":"Head39","v":"YearTD actual"},{"$f":"Head40","v":"YearTD budget"},{"$f":"Head41","v":"YTD variance"},{"$f":"Head41","v":"YTD variance"},{"$f":"Head8","v":"Full Year Forecast"}]
["R thousands",null,null,null,null,null,null,null,null,"%"]
["EXPENDITURE"]
[]
["Operating expenditure of Transfers and Grants"]
[{"$f":"'SC6'!A8","v":"National Government:"},null,{"$f":"SUM(C9:C13)","v":109410515.3},75539000,78527000,8804311.5700000003,34599901.489999995,45558419,-10958517.51,{"$f":"IF(I8=0,\"\",I8/H8)","v":-0.24053770412884609},{"$f":"SUM(K9:K13)","v":78527000}]
[null,null,null,null,null,null,null,null,{"$f":"G9-H9","v":0},""]
["Equitable Share",null,106261835.61,75000000,75000000,8558740.0299999993,32091687.52,43750000,{"$f":"G10-H10","v":-11658312.48},{"$f":"IF(H10=0,\"\",I10/H10)","v":-0.26647571382857144},75000000]
["Expanded Public Works Programme Integrated Grant",null,594749.91,539000,1827000,108876.99,1205247.06,958419,{"$f":"G11-H11","v":246828.06000000006},{"$f":"IF(H11=0,\"\",I11/H11)","v":0.25753669324168244},1827000]
["Local Government Financial Management Grant",null,2290911.7400000002,0,1700000,136694.54999999999,1302966.9099999999,850000,{"$f":"G12-H12","v":452966.90999999992},{"$f":"IF(H12=0,\"\",I12/H12)","v":0.53290224705882339},1700000]
["Municipal Disaster Relief Grant",null,263018.03999999998,0,0,0,0,0,{"$f":"G13-H13","v":0},{"$f":"IF(H13=0,\"\",I13/H13)","v":""},0]
[{"$f":"'SC6'!A18","v":"Provincial Government:"},null,{"$f":"SUM(C15:C15)","v":0},0,0,0,0,0,0,"",{"$f":"SUM(K15:K15)","v":0}]
[null,null,null,null,null,null,null,null,{"$f":"G15-H15","v":0},""]
[{"$f":"'SC6'!A22","v":"District Municipality:"},null,{"$f":"SUM(C17:C17)","v":0},0,0,0,0,0,0,"",{"$f":"SUM(K17:K17)","v":0}]
[null,null,null,null,null,null,null,null,0,""]
[{"$f":"'SC6'!A24","v":"Other grant providers:"},null,{"$f":"SUM(C19:C19)","v":0},0,0,0,0,0,0,"",{"$f":"SUM(K19:K19)","v":0}]
[null,null,null,null,null,null,null,null,0,""]
["Total operating expenditure of Transfers and Grants:",null,{"$f":"C8+C14+C16+C18","v":109410515.3},75539000,78527000,8804311.5700000003,34599901.489999995,45558419,-10958517.51,-0.24053770412884609,{"$f":"K8+K14+K16+K18","v":78527000}]
[]
["Capital expenditure of Transfers and Grants"]
[{"$f":"'SC6'!A29","v":"National Government:"},null,{"$f":"SUM(C24:C25)","v":22738382.280000001},202495233,202495233,5758720.0099999998,70502585.579999998,118122333,-47619747.420000002,{"$f":"IF(I23=0,\"\",I23/H23)","v":-0.40313923887703779},{"$f":"SUM(K24:K25)","v":202495233}]
["Municipal Infrastructure Grant",null,22738382.280000001,144470233,144470233,2102271.66,50040664.810000002,84274393,{"$f":"G24-H24","v":-34233728.189999998},{"$f":"IF(H24=0,\"\",I24/H24)","v":-0.40621744009476279},144470233]
["Water Services Infrastructure Grant  ",null,0,58025000,58025000,3656448.35,20461920.77,33847940,{"$f":"G25-H25","v":-13386019.23},{"$f":"IF(H25=0,\"\",I25/H25)","v":-0.39547515240218462},58025000]
[{"$f":"'SC6'!A33","v":"Provincial Government:"},null,{"$f":"SUM(C27:C27)","v":0},0,0,0,0,0,{"$f":"G26-H26","v":0},"",{"$f":"SUM(K27:K27)","v":0}]
["Specify (Add grant description)",null,0,0,0,0,0,0,{"$f":"G27-H27","v":0},{"$f":"IF(H27=0,\"\",I27/H27)","v":""},0]
[{"$f":"'SC6'!A36","v":"District Municipality:"},null,{"$f":"SUM(C29:C29)","v":0},0,0,0,0,0,0,"",{"$f":"SUM(K29:K29)","v":0}]
[null,null,null,null,null,null,null,null,0,""]
[{"$f":"'SC6'!A38","v":"Other grant providers:"},null,{"$f":"SUM(C31:C32)","v":0},0,0,0,0,0,0,"",{"$f":"SUM(K31:K32)","v":0}]
["Municipal Infrastructure Investment Unit",null,0,0,0,0,0,0,{"$f":"G31-H31","v":0},{"$f":"IF(H31=0,\"\",I31/H31)","v":""},0]
["National Small Business Council",null,0,0,0,0,0,0,{"$f":"G32-H32","v":0},{"$f":"IF(H32=0,\"\",I32/H32)","v":""},0]
["Total capital expenditure of Transfers and Grants",null,{"$f":"C23+C26+C28+C30","v":22738382.280000001},202495233,202495233,5758720.0099999998,70502585.579999998,118122333,-47619747.420000002,{"$f":"IF(I33=0,\"\",I33/H33)","v":-0.40313923887703779},{"$f":"K23+K26+K28+K30","v":202495233}]
[]
["TOTAL EXPENDITURE OF TRANSFERS AND GRANTS",null,{"$f":"C20+C33","v":132148897.58},278034233,281022233,14563031.58,105102487.06999999,163680752,-58578264.93,{"$f":"IF(I35=0,\"\",I35/H35)","v":-0.3578812060320935},{"$f":"K20+K33","v":281022233}]
[{"$f":"head27a","v":"References"}]

{"sheet":"SC7(2)","index":23,"n_rows":30,"n_cols":7,"rows_kept":30,"cut":false,"hidden":false,"merged":[[0,0,0,6],[1,0,2,0],[1,1,2,1],[1,2,1,6]]}
[{"$f":"muni& \" - \"&S71T& \" - \"&Head57","v":"NW375 Moses Kotane - Supporting Table SC7(2) Monthly Budget Statement - Expenditure against approved rollovers - M07 January"}]
[{"$f":"desc","v":"Description"},{"$f":"head27","v":"Ref"},{"$f":"Head2","v":"Budget Year 2020/21"}]
[null,null,{"$f":"\"Approved Rollover \" &Head1","v":"Approved Rollover 2019/20"},{"$f":"Head38","v":"Monthly actual"},{"$f":"Head39","v":"YearTD actual"},{"$f":"Head41","v":"YTD variance"},{"$f":"Head41","v":"YTD variance"}]
["R thousands",null,null,null,null,null,"%"]
["EXPENDITURE"]
[]
["Operating expenditure of Approved Roll-overs"]
[{"$f":"'SC6'!A8","v":"National Government:"},null,{"$f":"SUM(C9:C9)","v":0},{"$f":"SUM(D9:D9)","v":0},{"$f":"SUM(E9:E9)","v":0},{"$f":"SUM(F9:F9)","v":0},{"$f":"IF(F8=0,\"\",F8/C8)","v":""}]
["Local Government Equitable Share",null,0,0,0,{"$f":"E9-C9","v":0},{"$f":"IF(C9=0,\"\",F9/C9)","v":""}]
[{"$f":"'SC6'!A18","v":"Provincial Government:"},null,{"$f":"SUM(C11:C11)","v":0},{"$f":"SUM(D11:D11)","v":0},{"$f":"SUM(E11:E11)","v":0},{"$f":"SUM(F11:F11)","v":0},{"$f":"IF(F10=0,\"\",F10/C10)","v":""}]
[null,null,null,null,null,{"$f":"C11-E11","v":0},""]
[{"$f":"'SC6'!A22","v":"District Municipality:"},null,{"$f":"SUM(C13:C13)","v":0},{"$f":"SUM(D13:D13)","v":0},{"$f":"SUM(E13:E13)","v":0},{"$f":"SUM(F13:F13)","v":0},""]
[null,null,null,null,null,{"$f":"C13-E13","v":0},""]
[{"$f":"'SC6'!A24","v":"Other grant providers:"},null,{"$f":"SUM(C15:C15)","v":0},{"$f":"SUM(D15:D15)","v":0},{"$f":"SUM(E15:E15)","v":0},{"$f":"SUM(F15:F15)","v":0},""]
[null,null,null,null,null,{"$f":"C15-E15","v":0},""]
["Total operating expenditure of Approved Roll-overs",null,{"$f":"C8+C10+C12+C14","v":0},{"$f":"D8+D10+D12+D14","v":0},{"$f":"E8+E10+E12+E14","v":0},{"$f":"F8+F10+F12+F14","v":0},""]
[null,null,null,null,null,null,""]
["Capital expenditure of Approved Roll-overs",null,null,null,null,null,""]
[{"$f":"'SC6'!A29","v":"National Government:"},null,{"$f":"SUM(C20:C20)","v":0},{"$f":"SUM(D20:D20)","v":0},{"$f":"SUM(E20:E20)","v":0},{"$f":"SUM(F20:F20)","v":0},""]
[null,null,null,null,null,{"$f":"C20-E20","v":0},""]
[{"$f":"'SC6'!A33","v":"Provincial Government:"},null,{"$f":"SUM(C22:C22)","v":0},{"$f":"SUM(D22:D22)","v":0},{"$f":"SUM(E22:E22)","v":0},{"$f":"SUM(F22:F22)","v":0},""]
[null,null,null,null,null,{"$f":"C22-E22","v":0},""]
[{"$f":"'SC6'!A36","v":"District Municipality:"},null,{"$f":"SUM(C24:C24)","v":0},{"$f":"SUM(D24:D24)","v":0},{"$f":"SUM(E24:E24)","v":0},{"$f":"SUM(F24:F24)","v":0},""]
[null,null,null,null,null,{"$f":"C24-E24","v":0},""]
[{"$f":"'SC6'!A38","v":"Other grant providers:"},null,{"$f":"SUM(C26:C26)","v":0},{"$f":"SUM(D26:D26)","v":0},{"$f":"SUM(E26:E26)","v":0},{"$f":"SUM(F26:F26)","v":0},""]
[null,null,null,null,null,{"$f":"C26-E26","v":0},""]
["Total capital expenditure of Approved Roll-overs",null,{"$f":"C19+C21+C23+C25","v":0},{"$f":"D19+D21+D23+D25","v":0},{"$f":"E19+E21+E23+E25","v":0},{"$f":"F19+F21+F23+F25","v":0},""]
[]
["TOTAL EXPENDITURE OF APPROVED ROLL-OVERS",null,{"$f":"C16+C27","v":0},{"$f":"D16+D27","v":0},{"$f":"E16+E27","v":0},{"$f":"F16+F27","v":0},""]
[{"$f":"head27a","v":"References"}]

{"sheet":"SC8","index":24,"n_rows":116,"n_cols":11,"rows_kept":116,"cut":false,"hidden":false,"merged":[[1,0,2,0],[1,1,2,1],[0,0,0,10]]}
[{"$f":"muni& \" - \"&S71N& \" - \"&Head57","v":"NW375 Moses Kotane - Supporting Table SC8 Monthly Budget Statement - councillor and staff benefits  - M07 January"}]
["Summary of Employee and Councillor remuneration",{"$f":"head27","v":"Ref"},{"$f":"Head1","v":"2019/20"},{"$f":"Head2","v":"Budget Year 2020/21"}]
[null,null,{"$f":"Head5","v":"Audited Outcome"},{"$f":"Head6","v":"Original Budget"},{"$f":"Head7","v":"Adjusted Budget"},{"$f":"Head38","v":"Monthly actual"},{"$f":"Head39","v":"YearTD actual"},{"$f":"Head40","v":"YearTD budget"},{"$f":"Head41","v":"YTD variance"},{"$f":"Head41","v":"YTD variance"},{"$f":"Head8","v":"Full Year Forecast"}]
["R thousands",null,null,null,null,null,null,null,null,"%"]
[null,1,"A","B","C",null,null,null,null,null,"D"]
["Councillors (Political Office Bearers plus Other)"]
["Basic Salaries and Wages",null,15987849.92,16070604,16070604,1360060.75,10293635.109999999,9374533,{"$f":"G7-H7","v":919102.1099999994},{"$f":"IF(I7=0,\"\",I7/H7)","v":9.8042442220855092E-2},16070604]
["Pension and UIF Contributions",null,0,0,0,0,0,0,0,"",0]
["Medical Aid Contributions",null,0,0,0,0,0,0,0,"",0]
["Motor Vehicle Allowance",null,null,null,null,null,null,null,{"$f":"G10-H10","v":0},{"$f":"IF(I10=0,\"\",I10/H10)","v":""}]
["Cellphone Allowance",null,2945988,3019200,3019200,244800,1719500,1761200,{"$f":"G11-H11","v":-41700},{"$f":"IF(I11=0,\"\",I11/H11)","v":-2.3677038382920734E-2},3019200]
["Housing Allowances",null,0,0,0,0,0,0,{"$f":"G12-H12","v":0},{"$f":"IF(I12=0,\"\",I12/H12)","v":""},0]
["Other benefits and allowances",null,5194439.7300000004,5729310,5729310,421233.85,2894490.01,3342101,-447610.99000000022,-0.13393101824271625,5729310]
["Sub Total - Councillors",null,{"$f":"SUM(C7:C13)","v":24128277.650000002},24819114,24819114,2026094.6,14907625.119999999,14477834,429791.11999999918,2.9686147803600953E-2,24819114]
["% increase",4,null,{"$f":"IF(D14=0,\"\",(D14/C14)-1)","v":2.8631813676099682E-2},{"$f":"IF(E14=0,\"\",(E14/C14)-1)","v":2.8631813676099682E-2},null,null,null,null,null,{"$f":"IF(K14=0,\"\",(K14/C14)-1)","v":2.8631813676099682E-2}]
[]
["Senior Managers of the Municipality",3]
["Basic Salaries and Wages",null,2473004.58,9030280,9030280,1608417.8,2956055.06,5267682,{"$f":"G18-H18","v":-2311626.94},{"$f":"IF(I18=0,\"\",I18/H18)","v":-0.43883190746897782},9030280]
["Pension and UIF Contributions",null,318671.98,585009,585009,35489.07,242177.25,341285,-99107.75,-0.29039585683519636,585009]
["Medical Aid Contributions",null,99192.72,102537,102537,9007.32,61398.9,59822,1576.9000000000015,2.635986760723482E-2,102537]
["Overtime",null,0,0,0,0,0,0,0,"",0]
["Performance Bonus",null,184472.07,517917,517917,30000,219725.54,302127,{"$f":"G22-H22","v":-82401.459999999992},{"$f":"IF(I22=0,\"\",I22/H22)","v":-0.27273782217411879},517917]
["Motor Vehicle Allowance",null,978592.68,1818593,1818593,176549.39,395845.73,1060850,{"$f":"G23-H23","v":-665004.27},{"$f":"IF(I23=0,\"\",I23/H23)","v":-0.62685984823490604},1818593]
["Cellphone Allowance",null,0,0,0,0,0,0,{"$f":"G24-H24","v":0},{"$f":"IF(I24=0,\"\",I24/H24)","v":""},0]
["Housing Allowances",null,0,0,0,0,0,0,{"$f":"G25-H25","v":0},{"$f":"IF(I25=0,\"\",I25/H25)","v":""},0]
["Other benefits and allowances",null,270.27999999999997,953,953,89.1,207.9,560,-352.1,-0.62875000000000003,953]
["Payments in lieu of leave",null,0,0,0,0,0,0,0,"",0]
["Long service awards",null,0,0,0,0,0,0,0,"",0]
["Post-retirement benefit obligations",2,0,0,0,0,0,0,0,"",0]
["Sub Total - Senior Managers of Municipality",null,{"$f":"SUM(C18:C29)","v":4054204.31},12055289,12055289,{"$f":"SUM(F18:F29)","v":1859552.6800000002},{"$f":"SUM(G18:G29)","v":3875410.38},{"$f":"SUM(H18:H29)","v":7032326},-3156915.62,{"$f":"IF(I30=0,\"\",I30/H30)","v":-0.44891485690509797},12055289]
["% increase",4,null,{"$f":"IF(D30=0,\"\",(D30/C30)-1)","v":1.9735277450780471},{"$f":"IF(E30=0,\"\",(E30/C30)-1)","v":1.9735277450780471},null,null,null,null,null,{"$f":"IF(K30=0,\"\",(K30/C30)-1)","v":1.9735277450780471}]
[]
["Other Municipal Staff"]
["Basic Salaries and Wages",null,161086895.02000001,181074048,182362048,11929081.73,94511772.930000007,106270654,{"$f":"G34-H34","v":-11758881.069999993},{"$f":"IF(I34=0,\"\",I34/H34)","v":-0.11065031245596732},182362048]
["Pension and UIF Contributions",null,30167995.870000001,36853305,36853305,2738443.38,19084634.43,21497994,-2413359.5700000003,-0.11225975642192478,36853305]
["Medical Aid Contributions",null,11959665.49,26373845,26373845,1131116.23,7591017.0800000001,15384894,-7793876.9199999999,-0.50659282540393191,26373845]
["Overtime",null,null,null,null,null,null,null,0,""]
["Performance Bonus",null,9707942.1500000004,13014076,13014076,1388950.32,7809078.4000000004,7591675,217403.40000000037,2.8637079432404625E-2,13014076]
["Motor Vehicle Allowance",null,640000,540000,540000,-105000,80000,315000,{"$f":"G39-H39","v":-235000},{"$f":"IF(I39=0,\"\",I39/H39)","v":-0.74603174603174605},540000]
["Cellphone Allowance",null,null,null,null,null,null,null,{"$f":"G40-H40","v":0},{"$f":"IF(I40=0,\"\",I40/H40)","v":""}]
["Housing Allowances",null,478039.37,530395,530395,45272.83,307964.71000000002,309449,{"$f":"G41-H41","v":-1484.289999999979},{"$f":"IF(I41=0,\"\",I41/H41)","v":-4.796557752650611E-3},530395]
["Other benefits and allowances",null,10126718.689999999,390449,390449,27781.83,6445750.5700000003,227920,6217830.5700000003,27.280758906633906,390449]
["Payments in lieu of leave",null,6079956.79,0,0,0,0,0,0,"",0]
["Long service awards",null,2623440.66,0,0,0,0,0,0,"",0]
["Post-retirement benefit obligations",2,0,0,0,0,0,0,0,"",0]
["Sub Total - Other Municipal Staff",null,{"$f":"SUM(C34:C45)","v":232870654.04000002},258776118,260064118,{"$f":"SUM(F34:F45)","v":17155646.319999997},{"$f":"SUM(G34:G45)","v":135830218.12},{"$f":"SUM(H34:H45)","v":151597586},-15767367.879999995,{"$f":"IF(I46=0,\"\",I46/H46)","v":-0.10400804060296841},260064118]
["% increase",4,null,{"$f":"IF(D46=0,\"\",(D46/C46)-1)","v":0.11124400395916867},{"$f":"IF(E46=0,\"\",(E46/C46)-1)","v":0.11677497137672388},null,null,null,null,null,{"$f":"IF(K46=0,\"\",(K46/C46)-1)","v":0.11677497137672388}]
[]
["Total Parent Municipality",null,{"$f":"C14+C30+C46","v":261053136.00000003},{"$f":"D14+D30+D46","v":295650521},296938521,21041293.599999998,154613253.62,173107746,{"$f":"G49-H49","v":-18494492.379999995},{"$f":"IF(I49=0,\"\",I49/H49)","v":-0.10683804051148581},296938521]
[null,null,null,{"$f":"IF(D49=0,\"\",(D49/C49)-1)","v":0.13253004936129154},{"$f":"IF(E49=0,\"\",(E49/C49)-1)","v":0.13746391079553999},null,null,null,null,null,{"$f":"IF(K49=0,\"\",(K49/C49)-1)","v":0.13746391079553999}]
["Unpaid salary, allowances & benefits in arrears:"]
[]
["Board Members of Entities"]
["Basic Salaries and Wages",null,null,null,null,null,null,null,{"$f":"G54-H54","v":0},{"$f":"IF(I54=0,\"\",I54/H54)","v":""}]
["Pension and UIF Contributions",null,null,null,null,null,null,null,0,""]
["Medical Aid Contributions",null,null,null,null,null,null,null,0,""]
["Overtime",null,null,null,null,null,null,null,{"$f":"G57-H57","v":0},{"$f":"IF(I57=0,\"\",I57/H57)","v":""}]
["Performance Bonus",null,null,null,null,null,null,null,{"$f":"G58-H58","v":0},{"$f":"IF(I58=0,\"\",I58/H58)","v":""}]
["Motor Vehicle Allowance",null,null,null,null,null,null,null,{"$f":"G59-H59","v":0},{"$f":"IF(I59=0,\"\",I59/H59)","v":""}]
["Cellphone Allowance",null,null,null,null,null,null,null,{"$f":"G60-H60","v":0},{"$f":"IF(I60=0,\"\",I60/H60)","v":""}]
["Housing Allowances",null,null,null,null,null,null,null,{"$f":"G61-H61","v":0},{"$f":"IF(I61=0,\"\",I61/H61)","v":""}]
["Other benefits and allowances",null,null,null,null,null,null,null,0,""]
["Board Fees",null,null,null,null,null,null,null,{"$f":"G63-H63","v":0},{"$f":"IF(I63=0,\"\",I63/H63)","v":""}]
["Payments in lieu of leave",null,null,null,null,null,null,null,0,""]
["Long service awards",null,null,null,null,null,null,null,0,""]
["Post-retirement benefit obligations",null,null,null,null,null,null,null,0,""]
["Sub Total - Board Members of Entities",2,{"$f":"SUM(C54:C66)","v":0},0,0,{"$f":"SUM(F54:F66)","v":0},{"$f":"SUM(G54:G66)","v":0},{"$f":"SUM(H54:H66)","v":0},0,{"$f":"IF(I67=0,\"\",I67/H67)","v":""},0]
["% increase",4,null,{"$f":"IF(D67=0,\"\",(D67/C67)-1)","v":""},{"$f":"IF(E67=0,\"\",(E67/C67)-1)","v":""},null,null,null,null,null,{"$f":"IF(K67=0,\"\",(K67/C67)-1)","v":""}]
[]
["Senior Managers of Entities"]
["Basic Salaries and Wages",null,null,null,null,null,null,null,{"$f":"G71-H71","v":0},{"$f":"IF(I71=0,\"\",I71/H71)","v":""}]
["Pension and UIF Contributions",null,null,null,null,null,null,null,0,""]
["Medical Aid Contributions",null,null,null,null,null,null,null,0,""]
["Overtime",null,null,null,null,null,null,null,0,""]
["Performance Bonus",null,null,null,null,null,null,null,{"$f":"G75-H75","v":0},{"$f":"IF(I75=0,\"\",I75/H75)","v":""}]
["Motor Vehicle Allowance",null,null,null,null,null,null,null,{"$f":"G76-H76","v":0},{"$f":"IF(I76=0,\"\",I76/H76)","v":""}]
["Cellphone Allowance",null,null,null,null,null,null,null,{"$f":"G77-H77","v":0},{"$f":"IF(I77=0,\"\",I77/H77)","v":""}]
["Housing Allowances",null,null,null,null,null,null,null,{"$f":"G78-H78","v":0},{"$f":"IF(I78=0,\"\",I78/H78)","v":""}]
["Other benefits and allowances",null,null,null,null,null,null,null,0,""]
["Payments in lieu of leave",null,null,null,null,null,null,null,0,""]
["Long service awards",null,null,null,null,null,null,null,0,""]
["Post-retirement benefit obligations",2,null,null,null,null,null,null,0,""]
["Sub Total - Senior Managers of Entities",null,{"$f":"SUM(C71:C82)","v":0},0,0,{"$f":"SUM(F71:F82)","v":0},{"$f":"SUM(G71:G82)","v":0},{"$f":"SUM(H71:H82)","v":0},0,{"$f":"IF(I83=0,\"\",I83/H83)","v":""},0]
["% increase",4,null,{"$f":"IF(D83=0,\"\",(D83/C83)-1)","v":""},{"$f":"IF(E83=0,\"\",(E83/C83)-1)","v":""},null,null,null,null,null,{"$f":"IF(K83=0,\"\",(K83/C83)-1)","v":""}]
[]
["Other Staff of Entities"]
["Basic Salaries and Wages",null,null,null,null,null,null,null,{"$f":"G87-H87","v":0},{"$f":"IF(I87=0,\"\",I87/H87)","v":""}]
["Pension and UIF Contributions",null,null,null,null,null,null,null,0,""]
["Medical Aid Contributions",null,null,null,null,null,null,null,{"$f":"G89-H89","v":0},{"$f":"IF(I89=0,\"\",I89/H89)","v":""}]
["Overtime",null,null,null,null,null,null,null,{"$f":"G90-H90","v":0},{"$f":"IF(I90=0,\"\",I90/H90)","v":""}]
["Performance Bonus",null,null,null,null,null,null,null,{"$f":"G91-H91","v":0},{"$f":"IF(I91=0,\"\",I91/H91)","v":""}]
["Motor Vehicle Allowance",null,null,null,null,null,null,null,{"$f":"G92-H92","v":0},{"$f":"IF(I92=0,\"\",I92/H92)","v":""}]
["Cellphone Allowance",null,null,null,null,null,null,null,0,""]
["Housing Allowances",null,null,null,null,null,null,null,0,""]
["Other benefits and allowances",null,null,null,null,null,null,null,0,""]
["Payments in lieu of leave",null,null,null,null,null,null,null,0,""]
["Long service awards",null,null,null,null,null,null,null,0,""]
["Post-retirement benefit obligations",null,null,null,null,null,null,null,0,""]
["Sub Total - Other Staff of Entities",null,{"$f":"SUM(C87:C98)","v":0},0,0,0,0,0,0,{"$f":"IF(I99=0,\"\",I99/H99)","v":""},{"$f":"SUM(K87:K98)","v":0}]
["% increase",4,null,{"$f":"IF(D99=0,\"\",(D99/C99)-1)","v":""},{"$f":"IF(E99=0,\"\",(E99/C99)-1)","v":""},null,null,null,null,null,{"$f":"IF(K99=0,\"\",(K99/C99)-1)","v":""}]
[]
["Total Municipal Entities",null,{"$f":"C67+C83+C99","v":0},0,0,0,0,0,{"$f":"G102-H102","v":0},{"$f":"IF(I102=0,\"\",I102/H102)","v":""},{"$f":"K67+K83+K99","v":0}]
[]
["TOTAL SALARY, ALLOWANCES & BENEFITS",null,{"$f":"C49+C102","v":261053136.00000003},295650521,296938521,21041293.599999998,154613253.62,173107746,{"$f":"G104-H104","v":-18494492.379999995},{"$f":"IF(I104=0,\"\",I104/H104)","v":-0.10683804051148581},{"$f":"K49+K102","v":296938521}]
["% increase",4,null,{"$f":"IF(D104=0,\"\",(D104/C104)-1)","v":0.13253004936129154},{"$f":"IF(E104=0,\"\",(E104/C104)-1)","v":0.13746391079553999},null,null,null,null,null,{"$f":"IF(K104=0,\"\",(K104/C104)-1)","v":0.13746391079553999}]
["TOTAL MANAGERS AND STAFF",null,{"$f":"C30+C46+C83+C99","v":236924858.35000002},270831407,272119407,19015198.999999996,139705628.5,158629912,-18924283.499999996,{"$f":"IF(I106=0,\"\",I106/H106)","v":-0.11929832943486722},{"$f":"K30+K46+K83+K99","v":272119407}]
[{"$f":"head27a","v":"References"}]
["1. Include 'Loans and advances' where applicable if any reportable amounts until phased compliance with s164 of MFMA achieved"]
["2. If benefits in kind are provided (e.g. provision of living quarters) the full market value must be shown as the cost to the municipality"]
["3. s57 of the Systems Act"]
["4. B/A, C/A, D/A"]
["Column Definitions:"]
["A. Audited actual 2005/06 (audited financial statements). If audited amounts unavailable, unaudited amounts must be provided with a note stating these are unaudited"]
["B. The original budget approved by council for the 2006/07 budget year."]
["C. The budget for 2006/07 budget year as adjusted by council resolution in terms of section 28 of the MFMA."]
["D. An estimate of final actual amounts (pre audit - 2006/07 budget year) at the time of preparing the budget for the 2007/08 budget year. This may differ from C."]

{"sheet":"SC9","index":25,"n_rows":66,"n_cols":17,"rows_kept":66,"cut":false,"hidden":false,"merged":[[2,15,3,15],[2,16,3,16],[1,0,2,0],[2,14,3,14],[1,1,2,1],[1,2,1,13],[1,14,1,16]]}
[{"$f":"muni& \" - \"&S71O& \" - \"&Head57","v":"NW375 Moses Kotane - Supporting Table SC9 Monthly Budget Statement - actuals and revised targets for cash receipts - M07 January"}]
[{"$f":"desc","v":"Description"},{"$f":"head27","v":"Ref"},{"$f":"Head2","v":"Budget Year 2020/21"},null,null,null,null,null,null,null,null,null,null,null,{"$f":"'Template names'!B5","v":"2020/21 Medium Term Revenue & Expenditure Framework"}]
[null,null,"July","August","Sept","October","Nov","Dec","January","Feb","March","April","May","June",{"$f":"Head9","v":"Budget Year 2020/21"},{"$f":"Head10","v":"Budget Year +1 2021/22"},{"$f":"Head11","v":"Budget Year +2 2022/23"}]
["R thousands",1,"Outcome","Outcome","Outcome","Outcome","Outcome","Outcome","Outcome","Budget","Budget","Budget","Budget","Budget"]
["Cash Receipts By Source"]
["Property rates",null,0,0,0,35578994.210000001,3553294.01,3026676.44,6056968.1600000001,5921978.8300000001,5921978.8300000001,5921978.8300000001,5921978.8300000001,{"$f":"O6-SUM(C6:M6)","v":-840102.13999998569},71063746,0,0]
["Service charges - electricity revenue",null,null,null,null,null,null,null,null,null,null,null,null,0]
["Service charges - water revenue",null,0,0,0,4627689.32,6051811.5,3149793.86,3619011.06,5717590,5717590,5717590,5717590,28292414.260000005,68611080,0,0]
["Service charges - sanitation revenue",null,0,0,0,30196.02,35327.32,125395.14,22087.22,62250,62250,62250,62250,284994.30000000005,747000,0,0]
["Service charges - refuse",null,0,0,0,38406.699999999997,41211.67,32282.99,14905.05,-51977.919999999998,-51977.919999999998,-51977.919999999998,-51977.919999999998,-542629.73,-623735,0,0]
[]
["Rental of facilities and equipment",null,0,0,0,6264.89,6891.37,6891.37,6891.37,0,0,0,0,-26939,0,0,0]
["Interest earned - external investments",null,0,0,0,200034.69,184171.76,524612.94999999995,26429.72,0,0,0,0,-935249.11999999988,0,0,0]
["Interest earned - outstanding debtors",null,null,null,null,null,null,null,null,null,null,null,null,0]
["Dividends received",null,null,null,null,null,null,null,null,null,null,null,null,0]
["Fines, penalties and forfeits",null,0,0,0,0,0,0,886600,0,0,0,0,-886600,0,0,0]
["Licences and permits",null,null,null,null,null,null,null,null,null,null,null,null,0]
["Agency services",null,null,null,null,null,null,null,null,null,null,null,null,0]
["Transfers and Subsidies - Operational",null,0,0,0,0,766000,0,0,45861647.25,45861647.25,45861647.25,45861647.25,366127178,550339767,0,0]
["Other revenue",null,0,0,0,9460896.8100000005,62645648.859999999,212817573.47,-24389812.84,643750,643750,643750,643750,-255384306.29999998,7725000,0,0]
["Cash Receipts by Source",null,{"$f":"SUM(C6:C10)+SUM(C12:C20)","v":0},{"$f":"SUM(D6:D10)+SUM(D12:D20)","v":0},0,49942482.640000008,73284356.49000001,219683226.22,-13756920.259999998,58155238.159999996,58155238.159999996,58155238.159999996,58155238.159999996,136088760.27000004,697862858,0,0]
[null,null,null,null,null,null,null,null,null,null,null,null,null,{"$f":"O22-SUM(C22:M22)","v":0}]
["Other Cash Flows by Source",null,null,null,null,null,null,null,null,null,null,null,null,0]
[{"$f":"'C4-FinPerf RE'!A39","v":"Transfers and subsidies - capital (monetary allocations) (National / Provincial and District)"},null,0,0,0,15000000,69794000,1318160.1100000001,0,16874600.25,16874600.25,16874600.25,16874600.25,48884641.889999986,202495203,0,0]
[{"$f":"'C4-FinPerf RE'!A40","v":"Transfers and subsidies - capital (monetary allocations) (National / Provincial Departmental Agencies, Households, Non-profit Institutions, Private Enterprises, Public Corporatons, Higher Educational Institutions)"},null,null,null,null,null,null,null,null,null,null,null,null,0]
["Proceeds on Disposal of Fixed and Intangible Assets",null,null,null,null,null,null,null,null,null,null,null,null,0]
["Short term loans",null,null,null,null,null,null,null,null,null,null,null,null,0]
["Borrowing long term/refinancing",null,null,null,null,null,null,null,null,null,null,null,null,0]
["Increase (decrease) in consumer deposits",null,0,0,0,0,0,0,0,0,0,0,0,0,0,-15500,0]
[]
["Decrease (increase) in non-current receivables",null,0,0,0,0,0,0,0,0,0,0,0,0,0,0,0]
["Decrease (increase) in non-current investments",null,0,0,0,0,0,0,0,0,0,0,0,0,0,0,0]
["Total Cash Receipts by Source",null,{"$f":"SUM(C21:C29)+SUM(C31:C32)","v":0},{"$f":"SUM(D21:D29)+SUM(D31:D32)","v":0},0,64942482.640000008,143078356.49000001,221001386.33000001,-13756920.259999998,75029838.409999996,75029838.409999996,75029838.409999996,75029838.409999996,184973402.16000003,900358061,-15500,0]
[null,null,null,null,null,null,null,null,null,null,null,null,null,{"$f":"O34-SUM(C34:M34)","v":0}]
["Cash Payments by Type",null,null,null,null,null,null,null,null,null,null,null,null,0]
["Employee related costs",null,0,0,0,-4960322.05,4071580.9,-82106.66,1157997.26,24744876.75,24744876.75,24744876.75,24744876.75,197771864.55000001,296938521,0,0]
["Remuneration of councillors",null,null,null,null,null,null,null,null,null,null,null,null,0]
["Interest paid",null,0,0,0,0,0,0,0,253650.67,253650.67,253650.67,253650.67,2029205.3199999998,3043808,0,0]
["Bulk purchases - Electricity",null,0,0,0,0,0,309230,0,2333333.34,2333333.34,2333333.34,2333333.34,18357436.640000001,28000000,0,0]
["Bulk purchases - Water & Sewer",null,0,0,0,6127899.6100000003,0,20975447.649999999,9786994.6300000008,6250000,6250000,6250000,6250000,13109658.109999999,75000000,0,0]
["Other materials",null,null,null,null,null,null,null,null,null,null,null,null,0]
["Contracted services",null,null,null,null,null,null,null,null,null,null,null,null,0]
["Grants and subsidies paid - other municipalities",null,null,null,null,null,null,null,null,null,null,null,null,0]
["Grants and subsidies paid - other",null,null,null,null,null,null,null,null,null,null,null,null,0]
["General expenses",null,0,0,0,36775803.939999998,16344662.58,87844408.230000004,16199963.34,41359860.5,41359860.5,41359860.5,41359860.5,173714045.90999997,496318326,0,0]
["Cash Payments by Type",{"$f":"SUM(B36:B45)","v":0},{"$f":"SUM(C36:C45)","v":0},{"$f":"SUM(D36:D45)","v":0},0,37943381.5,20416243.48,109046979.22,27144955.23,74941721.260000005,74941721.260000005,74941721.260000005,74941721.260000005,404982210.52999997,899300655,0,0]
[null,null,null,null,null,null,null,null,null,null,null,null,null,{"$f":"O47-SUM(C47:M47)","v":0}]
["Other Cash Flows/Payments by Type"]
["Capital assets",null,0,0,0,6350586.9000000004,-247188.91,34705421.409999996,6904946.1900000004,0,0,0,0,{"$f":"O49-SUM(C49:M49)","v":-47713765.589999996},0,0,0]
["Repayment of borrowing",null,0,619740.53,786201.42,140601.5,0,1102235.1399999999,0,311111.08,311111.08,311111.08,311111.08,{"$f":"O50-SUM(C50:M50)","v":-1093222.9100000001},2800000,0,0]
["Other Cash Flows/Payments",null,null,null,null,null,null,null,null,null,null,null,null,{"$f":"O51-SUM(C51:M51)","v":0}]
["Total Cash Payments by Type",{"$f":"SUM(B46:B51)","v":0},0,619740.53,786201.42,44434569.899999999,20169054.57,144854635.76999998,34049901.420000002,75252832.340000004,75252832.340000004,75252832.340000004,75252832.340000004,356175222.02999997,902100655,0,0]
[null,null,null,null,null,null,null,null,null,null,null,null,null,{"$f":"O53-SUM(C53:M53)","v":0}]
["NET INCREASE/(DECREASE) IN CASH HELD",{"$f":"B33-B52","v":0},0,-619740.53,-786201.42,20507912.74000001,122909301.92000002,76146750.560000032,-47806821.68,-222993.93000000715,-222993.93000000715,-222993.93000000715,-222993.93000000715,-171201819.86999995,-1742594,-15500,0]
["Cash/cash equivalents at the month/year beginning:",null,48780650.810000002,{"$f":"C56","v":48780650.810000002},{"$f":"D56","v":48160910.280000001},47374708.859999999,67882621.600000009,190791923.52000004,266938674.08000007,219131852.40000007,218908858.47000006,218685864.54000005,218462870.61000004,218239876.68000004,{"$f":"C55","v":48780650.810000002},{"$f":"O56","v":47038056.810000002},{"$f":"P56","v":47022556.810000002}]
["Cash/cash equivalents at the month/year end:",null,{"$f":"C54+C55","v":48780650.810000002},{"$f":"D54+D55","v":48160910.280000001},{"$f":"E54+E55","v":47374708.859999999},67882621.600000009,190791923.52000004,266938674.08000007,219131852.40000007,218908858.47000006,218685864.54000005,218462870.61000004,218239876.68000004,47038056.810000092,{"$f":"O54+O55","v":47038056.810000002},{"$f":"P54+P55","v":47022556.810000002},{"$f":"Q54+Q55","v":47022556.810000002}]
[{"$f":"head27a","v":"References"}]
["1. Replace 'budget' heading with adjusted budget, or 'outcome' only for month/s complete"]
["2. Total of monthly amounts must always agree to the approved or adjusted budget"]
["3. Amend 'cash-at-beginning' when prior year actual known (as part of the adjustments budget)"]
[]
[]
[]
[]
[null,null,null,null,{"$f":"E46+E64","v":0},37943381.5,20416243.48,109046979.22,27144955.23,74941721.260000005,74941721.260000005,74941721.260000005,null,{"$f":"N46+N64","v":404982210.52999997},899300655,0]
[null,null,null,null,{"$f":"E54-E64","v":-786201.42},20507912.74000001,122909301.92000002,76146750.560000032,-47806821.68,-222993.93000000715,-222993.93000000715,-222993.93000000715,{"$f":"M54-M64","v":-222993.93000000715},{"$f":"N54-N64","v":-171201819.86999995},-1742594,-15500]

{"sheet":"SC10","index":26,"n_rows":46,"n_cols":11,"rows_kept":46,"cut":false,"hidden":false,"merged":[[1,0,2,0],[1,1,2,1],[0,0,0,10]]}
[{"$f":"muni& \" - \"&S71P& \" - \"&Head57","v":"NW375 Moses Kotane - NOT REQUIRED - municipality does not have entities or this is the parent municipality's budget - M07 January"}]
[{"$f":"desc","v":"Description"},{"$f":"head27","v":"Ref"},{"$f":"Head1","v":"2019/20"},{"$f":"Head2","v":"Budget Year 2020/21"}]
[null,null,{"$f":"Head5","v":"Audited Outcome"},{"$f":"Head6","v":"Original Budget"},{"$f":"Head7","v":"Adjusted Budget"},{"$f":"Head38","v":"Monthly actual"},{"$f":"Head39","v":"YearTD actual"},{"$f":"Head40","v":"YearTD budget"},{"$f":"Head41","v":"YTD variance"},{"$f":"Head41","v":"YTD variance"},{"$f":"Head8","v":"Full Year Forecast"}]
["R thousands",1,null,null,null,null,null,null,null,"%"]
[{"$f":"'C4-FinPerf RE'!A5","v":"Revenue By Source"}]
[{"$f":"'C4-FinPerf RE'!A6","v":"Property rates"},null,null,null,null,null,null,null,{"$f":"G6-H6","v":0},{"$f":"IF(I6=0,\"\",I6/H6)","v":""}]
[{"$f":"'C4-FinPerf RE'!A7","v":"Service charges - electricity revenue"},null,null,null,null,null,null,null,0,{"$f":"IF(I7=0,\"\",I7/H7)","v":""}]
[{"$f":"'C4-FinPerf RE'!A8","v":"Service charges - water revenue"},null,null,null,null,null,null,null,0,""]
[{"$f":"'C4-FinPerf RE'!A9","v":"Service charges - sanitation revenue"},null,null,null,null,null,null,null,0,""]
[{"$f":"'C4-FinPerf RE'!A10","v":"Service charges - refuse revenue"},null,null,null,null,null,null,null,0,""]
[]
[{"$f":"'C4-FinPerf RE'!A12","v":"Rental of facilities and equipment"},null,null,null,null,null,null,null,0,""]
[{"$f":"'C4-FinPerf RE'!A13","v":"Interest earned - external investments"},null,null,null,null,null,null,null,0,""]
[{"$f":"'C4-FinPerf RE'!A14","v":"Interest earned - outstanding debtors"},null,null,null,null,null,null,null,0,""]
[{"$f":"'C4-FinPerf RE'!A15","v":"Dividends received"},null,null,null,null,null,null,null,0,""]
[{"$f":"'C4-FinPerf RE'!A16","v":"Fines, penalties and forfeits"},null,null,null,null,null,null,null,0,""]
[{"$f":"'C4-FinPerf RE'!A17","v":"Licences and permits"},null,null,null,null,null,null,null,0,""]
[{"$f":"'C4-FinPerf RE'!A18","v":"Agency services"},null,null,null,null,null,null,null,0,""]
[{"$f":"'C4-FinPerf RE'!A19","v":"Transfers and subsidies"},null,null,null,null,null,null,null,0,""]
[{"$f":"'C4-FinPerf RE'!A20","v":"Other revenue"},null,null,null,null,null,null,null,0,""]
[{"$f":"'C4-FinPerf RE'!A21","v":"Gains"},null,null,null,null,null,null,null,0,""]
["Total Revenue (excluding capital transfers and contributions)",null,{"$f":"SUM(C6:C10)+SUM(C12:C21)","v":0},0,0,0,0,0,{"$f":"G22-H22","v":0},"",{"$f":"SUM(K6:K10)+SUM(K12:K21)","v":0}]
[]
["Expenditure By Type"]
[{"$f":"'C4-FinPerf RE'!A25","v":"Employee related costs"},null,null,null,null,null,null,null,{"$f":"G25-H25","v":0},{"$f":"IF(I25=0,\"\",I25/H25)","v":""}]
[{"$f":"'C4-FinPerf RE'!A26","v":"Remuneration of councillors"},null,null,null,null,null,null,null,0,""]
[{"$f":"'C4-FinPerf RE'!A27","v":"Debt impairment"},null,null,null,null,null,null,null,0,""]
[{"$f":"'C4-FinPerf RE'!A28","v":"Depreciation & asset impairment"},null,null,null,null,null,null,null,0,""]
[{"$f":"'C4-FinPerf RE'!A29","v":"Finance charges"},null,null,null,null,null,null,null,0,""]
[{"$f":"'C4-FinPerf RE'!A30","v":"Bulk purchases"},null,null,null,null,null,null,null,0,""]
[{"$f":"'C4-FinPerf RE'!A31","v":"Other materials"},null,null,null,null,null,null,null,0,""]
[{"$f":"'C4-FinPerf RE'!A32","v":"Contracted services"},null,null,null,null,null,null,null,0,""]
[{"$f":"'C4-FinPerf RE'!A33","v":"Transfers and subsidies"},null,null,null,null,null,null,null,0,""]
[{"$f":"'C4-FinPerf RE'!A34","v":"Other expenditure"},null,null,null,null,null,null,null,0,""]
[{"$f":"'C4-FinPerf RE'!A35","v":"Losses"},null,null,null,null,null,null,null,0,""]
["Total Expenditure",null,{"$f":"SUM(C25:C35)","v":0},0,0,0,0,0,0,"",{"$f":"SUM(K25:K35)","v":0}]
[null,null,null,null,null,null,null,null,0]
[{"$f":"'C4-FinPerf RE'!A38","v":"Surplus/(Deficit)"},null,{"$f":"C22-C36","v":0},0,0,0,0,0,0,"",{"$f":"K22-K36","v":0}]
[{"$f":"'C4-FinPerf RE'!A39","v":"Transfers and subsidies - capital (monetary allocations) (National / Provincial and District)"},null,null,null,null,null,null,null,0,""]
[{"$f":"'C4-FinPerf RE'!A40","v":"Transfers and subsidies - capital (monetary allocations) (National / Provincial Departmental Agencies, Households, Non-profit Institutions, Private Enterprises, Public Corporatons, Higher Educational Institutions)"},null,null,null,null,null,null,null,0,""]
[{"$f":"'C4-FinPerf RE'!A41","v":"Transfers and subsidies - capital (in-kind - all) "},null,null,null,null,null,null,null,0,""]
[{"$f":"'C4-FinPerf RE'!A42","v":"Surplus/(Deficit) after capital transfers & contributions"},null,{"$f":"C38+SUM(C39:C41)","v":0},{"$f":"D38+SUM(D39:D41)","v":0},0,0,0,0,0,"",0]
[{"$f":"'C4-FinPerf RE'!A43","v":"Taxation"},null,null,null,null,null,null,null,0,""]
[{"$f":"'C4-FinPerf RE'!A44","v":"Surplus/(Deficit) after taxation"},null,{"$f":"C42-C43","v":0},0,0,0,0,0,0,"",{"$f":"K42-K43","v":0}]
[{"$f":"head27a","v":"References"}]
["1. Votes (consolidated) are revenue sources and expenditure type"]

{"sheet":"SC11","index":27,"n_rows":49,"n_cols":11,"rows_kept":49,"cut":false,"hidden":false,"merged":[[1,0,2,0],[1,1,2,1],[0,0,0,10],[1,3,1,10]]}
[{"$f":"muni& \" - \"&S71Q& \" - \"&Head57","v":"NW375 Moses Kotane - NOT REQUIRED - municipality does not have entities or this is the parent municipality's budget - M07 January"}]
[{"$f":"desc","v":"Description"},{"$f":"head27","v":"Ref"},{"$f":"Head1","v":"2019/20"},{"$f":"Head2","v":"Budget Year 2020/21"}]
[null,null,{"$f":"Head5","v":"Audited Outcome"},{"$f":"Head6","v":"Original Budget"},{"$f":"Head7","v":"Adjusted Budget"},{"$f":"Head38","v":"Monthly actual"},{"$f":"Head39","v":"YearTD actual"},{"$f":"Head40","v":"YearTD budget"},{"$f":"Head41","v":"YTD variance"},{"$f":"Head41","v":"YTD variance"},{"$f":"Head8","v":"Full Year Forecast"}]
["R thousands",null,null,null,null,null,null,null,null,"%"]
["Revenue By Municipal Entity"]
["Insert name of municipal entity",null,null,null,null,null,null,null,{"$f":"G6-H6","v":0},{"$f":"IF(I6=0,\"\",I6/H6)","v":""}]
[null,null,null,null,null,null,null,null,0,{"$f":"IF(I7=0,\"\",I7/H7)","v":""}]
[null,null,null,null,null,null,null,null,0,""]
[null,null,null,null,null,null,null,null,0,""]
[null,null,null,null,null,null,null,null,0,""]
[null,null,null,null,null,null,null,null,0,""]
[null,null,null,null,null,null,null,null,0,""]
[null,null,null,null,null,null,null,null,0,""]
[null,null,null,null,null,null,null,null,0,""]
[null,null,null,null,null,null,null,null,0,""]
["Total Operating Revenue",1,{"$f":"SUM(C6:C15)","v":0},0,0,0,0,0,0,"",{"$f":"SUM(K6:K15)","v":0}]
[]
["Expenditure By Municipal Entity"]
[{"$f":"A6","v":"Insert name of municipal entity"},null,null,null,null,null,null,null,0,{"$f":"IF(I19=0,\"\",I19/H19)","v":""}]
[{"$f":"IF(A7=\"\",\"\",A7)","v":""},null,null,null,null,null,null,null,0,""]
[{"$f":"IF(A8=\"\",\"\",A8)","v":""},null,null,null,null,null,null,null,0,""]
["",null,null,null,null,null,null,null,0,""]
["",null,null,null,null,null,null,null,0,""]
["",null,null,null,null,null,null,null,0,""]
["",null,null,null,null,null,null,null,0,""]
["",null,null,null,null,null,null,null,0,""]
["",null,null,null,null,null,null,null,0,""]
["",null,null,null,null,null,null,null,0,""]
["Total Operating Expenditure",2,{"$f":"SUM(C19:C28)","v":0},0,0,0,0,0,0,"",{"$f":"SUM(K19:K28)","v":0}]
[null,null,null,null,null,null,null,null,null,""]
[{"$f":"Head42","v":"Surplus/ (Deficit) for the yr/period"},null,{"$f":"C16-C29","v":0},{"$f":"D16-D29","v":0},0,0,0,0,{"$f":"I16+I29","v":0},"",0]
["Capital Expenditure By Municipal Entity"]
[{"$f":"$A$6","v":"Insert name of municipal entity"},null,null,null,null,null,null,null,0,""]
[{"$f":"IF(A7=\"\",\"\",A7)","v":""},null,null,null,null,null,null,null,0,""]
[{"$f":"IF(A8=\"\",\"\",A8)","v":""},null,null,null,null,null,null,null,0,""]
["",null,null,null,null,null,null,null,0,""]
["",null,null,null,null,null,null,null,0,""]
["",null,null,null,null,null,null,null,0,""]
["",null,null,null,null,null,null,null,0,""]
["",null,null,null,null,null,null,null,0,""]
["",null,null,null,null,null,null,null,0,""]
[null,null,null,null,null,null,null,null,null,""]
["Total Capital Expenditure",3,{"$f":"SUM(C32:C42)","v":0},{"$f":"SUM(D32:D42)","v":0},0,0,0,{"$f":"SUM(H32:H42)","v":0},{"$f":"G43-H43","v":0},"",0]
[{"$f":"head27a","v":"References"}]
["1. Must reconcile to the sum of all municipal entity monthly revenue reports"]
["2. Must reconcile to the sum of all municipal entity monthly expenditure reports"]
["3. YTD = Year to date; FAV - favourable variance or unfavourable variance"]
["4. Material variances to be explained"]
["5. Insert additional 'Adjustment' Budget column for each Adjustment made by an entity"]

{"sheet":"SC12","index":28,"n_rows":18,"n_cols":10,"rows_kept":18,"cut":false,"hidden":false,"merged":[[1,0,2,0],[0,0,0,9],[1,2,1,9]]}
[{"$f":"muni& \" - \"&S71R& \" - \"&Head57","v":"NW375 Moses Kotane - Supporting Table SC12 Monthly Budget Statement - capital expenditure trend - M07 January"}]
["Month",{"$f":"Head1","v":"2019/20"},{"$f":"Head2","v":"Budget Year 2020/21"}]
[null,{"$f":"Head5","v":"Audited Outcome"},{"$f":"Head6","v":"Original Budget"},{"$f":"Head7","v":"Adjusted Budget"},{"$f":"Head38","v":"Monthly actual"},{"$f":"Head39","v":"YearTD actual"},{"$f":"Head40","v":"YearTD budget"},{"$f":"Head41","v":"YTD variance"},{"$f":"Head41","v":"YTD variance"},"% spend of Original Budget"]
["R thousands",null,null,null,null,null,null,null,"%"]
["Monthly expenditure performance trend"]
["July",456868.82,16957936.09,16957953,6132272.3200000003,{"$f":"IF(E6>0,E6,\"\")","v":6132272.3200000003},{"$f":"IF(D6>0,D6,C6)","v":16957953},{"$f":"IF(F6=\"\",0,G6-F6)","v":10825680.68},{"$f":"IF(F6=\"\",\"\",IF(H6=0,\"\",H6/G6))","v":0.63838369406967932},{"$f":"IF(F6=\"\",\"\",F6/$C$18)","v":3.0134722222215398E-2}]
["August",15381965.960000001,16957936.09,16957953,12746732.560000001,{"$f":"IF(E7>0,E7+F6,\"\")","v":18879004.880000003},{"$f":"IF(D7>0,D7+D6,C7+C6)","v":33915906},15036901.119999997,0.44335837939873984,9.2773695981369753E-2]
["September",7655673.5800000001,16957936.09,16957953,6595187.1299999999,{"$f":"IF(E8>0,E8+F7,\"\")","v":25474192.010000002},{"$f":"IF(D8>0,D8+G7,C8+G7)","v":50873859},25399666.989999998,0.49926755094399261,0.12518323714246418]
["October",9883858.1899999995,16957936.09,16957953,6350586.9000000004,31824778.910000004,{"$f":"IF(D9>0,D9+G8,C9+G8)","v":67831812},36007033.089999996,0.53082811778638606,0.15639078341456777]
["November",12336810.07,16957936.09,16957953,-247188.91,"",84789765,0,"",""]
["December",19986773.059999999,16957936.09,16957953,34705421.409999996,{"$error":"#VALUE!"},101747718,{"$error":"#VALUE!"},{"$error":"#VALUE!"},{"$error":"#VALUE!"}]
["January",12180241.449999999,16957936.09,16957953,6904946.1900000004,{"$error":"#VALUE!"},118705671,{"$error":"#VALUE!"},{"$error":"#VALUE!"},{"$error":"#VALUE!"}]
["February",9130612.4199999999,16957936.09,16957953,0,"",135663624,0,"",""]
["March",11503317.720000001,16957936.09,16957953,0,"",152621577,0,"",""]
["April",3905991.8,16957936.09,16957953,0,"",169579530,0,"",""]
["May",7347078.2699999996,16957936.09,16957953,0,"",186537483,0,"",""]
["June",26876111.309999999,16957936.010000002,16957750,0,"",203495233,{"$f":"IF(F17=\"\",0,G17-F17)","v":0},{"$f":"IF(F17=\"\",\"\",IF(H17=0,\"\",H17/G17))","v":""},{"$f":"IF(F17=\"\",\"\",F17/$C$18)","v":""}]
["Total Capital expenditure",{"$f":"SUM(B6:B17)","v":136645302.64999998},{"$f":"SUM(C6:C17)","v":203495233},{"$f":"SUM(D6:D17)","v":203495233},{"$f":"SUM(E6:E17)","v":73187957.599999994}]

{"sheet":"SC13a","index":29,"n_rows":171,"n_cols":11,"rows_kept":171,"cut":false,"hidden":false,"merged":[[1,0,2,0],[1,1,2,1],[0,0,0,10]]}
[{"$f":"muni& \" - \"&S71Sa& \" - \"&Head57","v":"NW375 Moses Kotane - Supporting Table SC13a Monthly Budget Statement - capital expenditure on new assets by asset class - M07 January"}]
[{"$f":"desc","v":"Description"},{"$f":"head27","v":"Ref"},{"$f":"Head1","v":"2019/20"},{"$f":"Head2","v":"Budget Year 2020/21"}]
[null,null,{"$f":"Head5","v":"Audited Outcome"},{"$f":"Head6","v":"Original Budget"},{"$f":"Head7","v":"Adjusted Budget"},{"$f":"Head38","v":"Monthly actual"},{"$f":"Head39","v":"YearTD actual"},{"$f":"Head40","v":"YearTD budget"},{"$f":"Head41","v":"YTD variance"},{"$f":"Head41","v":"YTD variance"},{"$f":"Head8","v":"Full Year Forecast"}]
["R thousands",1,null,null,null,null,null,null,null,"%"]
["Capital expenditure on new assets by Asset Class/Sub-class"]
[]
["Infrastructure",null,{"$f":"C8+C13+C17+C27+C38+C45+C53+C63+C69","v":11561454.199999999},124425463,124425463,8553748.3000000007,44793090.100000001,72581614,{"$f":"H7-G7","v":27788523.899999999},{"$f":"IF(I7=0,\"\",I7/H7)","v":0.38285899649462191},{"$f":"K8+K13+K17+K27+K38+K45+K53+K63+K69","v":124425463}]
["Roads Infrastructure",null,{"$f":"SUM(C9:C12)","v":0},0,0,0,0,0,0,"",{"$f":"SUM(K9:K12)","v":0}]
["Roads",null,0,0,0,0,0,0,0,"",0]
["Road Structures",null,null,null,null,null,null,null,0,""]
["Road Furniture",null,null,null,null,null,null,null,0,""]
["Capital Spares",null,null,null,null,null,null,null,0,""]
["Storm water Infrastructure",null,{"$f":"SUM(C14:C16)","v":0},0,0,0,0,0,0,"",{"$f":"SUM(K14:K16)","v":0}]
["Drainage Collection",null,0,0,0,0,0,0,0,"",0]
["Storm water Conveyance",null,null,null,null,null,null,null,0,""]
["Attenuation",null,null,null,null,null,null,null,0,""]
["Electrical Infrastructure",null,{"$f":"SUM(C18:C26)","v":0},12265740,12265740,162522.9,4750472.55,7155057,2404584.4500000002,0.33606782587476247,{"$f":"SUM(K18:K26)","v":12265740}]
["Power Plants",null,null,null,null,null,null,null,0,""]
["HV Substations",null,null,null,null,null,null,null,0,""]
["HV Switching Station",null,null,null,null,null,null,null,0,""]
["HV Transmission Conductors",null,null,null,null,null,null,null,0,""]
["MV Substations",null,null,null,null,null,null,null,0,""]
["MV Switching Stations",null,null,null,null,null,null,null,0,""]
["MV Networks",null,null,null,null,null,null,null,0,""]
["LV Networks",null,0,12265740,12265740,162522.9,4750472.55,7155057,2404584.4500000002,0.33606782587476247,12265740]
["Capital Spares",null,null,null,null,null,null,null,0,""]
["Water Supply Infrastructure",null,{"$f":"SUM(C28:C37)","v":13781271.199999999},83272366,83272366,6447814,28576887.68,48575583,19998695.32,0.411702630928794,{"$f":"SUM(K28:K37)","v":83272366}]
["Dams and Weirs",null,null,null,null,null,null,null,0,""]
["Boreholes",null,null,null,null,null,null,null,0,""]
["Reservoirs",null,0,0,0,0,0,0,0,"",0]
["Pump Stations",null,null,null,null,null,null,null,0,""]
["Water Treatment Works",null,null,null,null,null,null,null,0,""]
["Bulk Mains",null,0,0,0,0,0,0,0,"",0]
["Distribution",null,13781271.199999999,83272366,83272366,6447814,28576887.68,48575583,19998695.32,0.411702630928794,83272366]
["Distribution Points",null,null,null,null,null,null,null,0,""]
["PRV Stations",null,null,null,null,null,null,null,0,""]
["Capital Spares",null,null,null,null,null,null,null,0,""]
["Sanitation Infrastructure",null,{"$f":"SUM(C39:C44)","v":0},25887357,25887357,1943411.4,11465729.869999999,15100974,{"$f":"H38-G38","v":3635244.1300000008},{"$f":"IF(I38=0,\"\",I38/H38)","v":0.24072911654572751},{"$f":"SUM(K39:K44)","v":25887357}]
["Pump Station",null,null,null,null,null,null,null,0,""]
["Reticulation",null,null,null,null,null,null,null,{"$f":"H40-G40","v":0},{"$f":"IF(I40=0,\"\",I40/H40)","v":""}]
["Waste Water Treatment Works",null,null,null,null,null,null,null,{"$f":"H41-G41","v":0},{"$f":"IF(I41=0,\"\",I41/H41)","v":""}]
["Outfall Sewers",null,null,null,null,null,null,null,{"$f":"H42-G42","v":0},{"$f":"IF(I42=0,\"\",I42/H42)","v":""}]
["Toilet Facilities",null,0,25887357,25887357,1943411.4,11465729.869999999,15100974,3635244.1300000008,0.24072911654572751,25887357]
["Capital Spares",null,null,null,null,null,null,null,0,""]
["Solid Waste Infrastructure",null,{"$f":"SUM(C46:C52)","v":-2219817},3000000,3000000,0,0,1750000,{"$f":"H45-G45","v":1750000},{"$f":"IF(I45=0,\"\",I45/H45)","v":1},{"$f":"SUM(K46:K52)","v":3000000}]
["Landfill Sites",null,-2219817,3000000,3000000,0,0,1750000,1750000,1,3000000]
["Waste Transfer Stations",null,null,null,null,null,null,null,0,""]
["Waste Processing Facilities",null,null,null,null,null,null,null,{"$f":"H48-G48","v":0},{"$f":"IF(I48=0,\"\",I48/H48)","v":""}]
["Waste Drop-off Points",null,null,null,null,null,null,null,0,""]
["Waste Separation Facilities",null,null,null,null,null,null,null,0,""]
["Electricity Generation Facilities",null,null,null,null,null,null,null,0,""]
["Capital Spares",null,null,null,null,null,null,null,0,""]
["Rail Infrastructure",null,{"$f":"SUM(C54:C62)","v":0},0,0,0,0,0,0,"",{"$f":"SUM(K54:K62)","v":0}]
["Rail Lines",null,null,null,null,null,null,null,0,""]
["Rail Structures",null,null,null,null,null,null,null,0,""]
["Rail Furniture",null,null,null,null,null,null,null,0,""]
["Drainage Collection",null,null,null,null,null,null,null,0,""]
["Storm water Conveyance",null,null,null,null,null,null,null,0,""]
["Attenuation",null,null,null,null,null,null,null,0,""]
["MV Substations",null,null,null,null,null,null,null,0,""]
["LV Networks",null,null,null,null,null,null,null,0,""]
["Capital Spares",null,null,null,null,null,null,null,0,""]
["Coastal Infrastructure",null,{"$f":"SUM(C64:C68)","v":0},0,0,0,0,0,0,"",{"$f":"SUM(K64:K68)","v":0}]
["Sand Pumps",null,null,null,null,null,null,null,0,""]
["Piers",null,null,null,null,null,null,null,0,""]
["Revetments",null,null,null,null,null,null,null,0,""]
["Promenades",null,null,null,null,null,null,null,0,""]
["Capital Spares",null,null,null,null,null,null,null,0,""]
["Information and Communication Infrastructure",null,{"$f":"SUM(C70:C73)","v":0},0,0,0,0,0,{"$f":"H69-G69","v":0},{"$f":"IF(I69=0,\"\",I69/H69)","v":""},{"$f":"SUM(K70:K73)","v":0}]
["Data Centres",null,null,null,null,null,null,null,{"$f":"H70-G70","v":0},""]
["Core Layers",null,null,null,null,null,null,null,{"$f":"H71-G71","v":0},""]
["Distribution Layers",null,null,null,null,null,null,null,{"$f":"H72-G72","v":0},""]
["Capital Spares",null,null,null,null,null,null,null,{"$f":"H73-G73","v":0},""]
[null,null,null,null,null,null,null,null,null,""]
["Community Assets",null,{"$f":"+C76+C99","v":0},7223512,7223512,0,0,4213720,{"$f":"H75-G75","v":4213720},1,{"$f":"+K76+K99","v":7223512}]
["Community Facilities",null,{"$f":"SUM(C77:C98)","v":0},7223512,7223512,0,0,4213720,{"$f":"H76-G76","v":4213720},{"$f":"IF(I76=0,\"\",I76/H76)","v":1},{"$f":"SUM(K77:K98)","v":7223512}]
["Halls",null,null,null,null,null,null,null,0,""]
["Centres",null,null,null,null,null,null,null,0,""]
["Crèches",null,null,null,null,null,null,null,0,""]
["Clinics/Care Centres",null,null,null,null,null,null,null,0,""]
["Fire/Ambulance Stations",null,null,null,null,null,null,null,0,""]
["Testing Stations",null,null,null,null,null,null,null,0,""]
["Museums",null,null,null,null,null,null,null,0,""]
["Galleries",null,null,null,null,null,null,null,0,""]
["Theatres",null,null,null,null,null,null,null,0,""]
["Libraries",null,null,null,null,null,null,null,0,""]
["Cemeteries/Crematoria",null,null,null,null,null,null,null,0,""]
["Police",null,null,null,null,null,null,null,{"$f":"H88-G88","v":0},{"$f":"IF(I88=0,\"\",I88/H88)","v":""}]
["Purls",null,null,null,null,null,null,null,0,""]
["Public Open Space",null,null,null,null,null,null,null,0,""]
["Nature Reserves",null,null,null,null,null,null,null,0,""]
["Public Ablution Facilities",null,null,null,null,null,null,null,0,""]
["Markets",null,0,7223512,7223512,0,0,4213720,4213720,1,7223512]
["Stalls",null,null,null,null,null,null,null,0,""]
["Abattoirs",null,null,null,null,null,null,null,0,""]
["Airports",null,null,null,null,null,null,null,0,""]
["Taxi Ranks/Bus Terminals",null,null,null,null,null,null,null,0,""]
["Capital Spares",null,null,null,null,null,null,null,0,""]
["Sport and Recreation Facilities",null,{"$f":"SUM(C100:C102)","v":0},0,0,0,0,0,0,"",{"$f":"SUM(K100:K102)","v":0}]
["Indoor Facilities",null,null,null,null,null,null,null,0,""]
["Outdoor Facilities",null,null,null,null,null,null,null,0,""]
["Capital Spares",null,null,null,null,null,null,null,0,""]
["Heritage assets",null,{"$f":"SUM(C104:C108)","v":0},0,0,0,0,0,0,"",{"$f":"SUM(K104:K108)","v":0}]
["Monuments",null,null,null,null,null,null,null,0,""]
["Historic Buildings",null,null,null,null,null,null,null,0,""]
["Works of Art",null,null,null,null,null,null,null,0,""]
["Conservation Areas",null,null,null,null,null,null,null,0,""]
["Other Heritage",null,null,null,null,null,null,null,0,""]
[null,null,null,null,null,null,null,null,0,""]
["Investment properties",null,{"$f":"+C111+C114","v":0},0,0,0,0,0,0,"",{"$f":"+K111+K114","v":0}]
["Revenue Generating",null,{"$f":"SUM(C112:C113)","v":0},0,0,0,0,0,0,"",{"$f":"SUM(K112:K113)","v":0}]
["Improved Property",null,null,null,null,null,null,null,0,""]
["Unimproved Property",null,null,null,null,null,null,null,0,""]
["Non-revenue Generating",null,{"$f":"SUM(C115:C116)","v":0},0,0,0,0,0,0,"",{"$f":"SUM(K115:K116)","v":0}]
["Improved Property",null,null,null,null,null,null,null,0,""]
["Unimproved Property",null,null,null,null,null,null,null,0,""]
["Other assets",null,{"$f":"+C118+C130","v":0},0,0,0,0,0,0,"",{"$f":"+K118+K130","v":0}]
["Operational Buildings",null,{"$f":"SUM(C119:C129)","v":0},0,0,0,0,0,0,"",{"$f":"SUM(K119:K129)","v":0}]
["Municipal Offices",null,0,0,0,0,0,0,0,"",0]
["Pay/Enquiry Points",null,null,null,null,null,null,null,0,{"$f":"IF(I120=0,\"\",I120/H120)","v":""}]
["Building Plan Offices",null,null,null,null,null,null,null,0,""]
["Workshops",null,null,null,null,null,null,null,0,""]
["Yards",null,null,null,null,null,null,null,0,""]
["Stores",null,null,null,null,null,null,null,0,""]
["Laboratories",null,null,null,null,null,null,null,0,""]
["Training Centres",null,null,null,null,null,null,null,0,""]
["Manufacturing Plant",null,null,null,null,null,null,null,0,""]
["Depots",null,null,null,null,null,null,null,0,""]
["Capital Spares",null,null,null,null,null,null,null,0,""]
["Housing",null,{"$f":"SUM(C131:C133)","v":0},0,0,0,0,0,0,"",{"$f":"SUM(K131:K133)","v":0}]
["Staff Housing",null,null,null,null,null,null,null,0,""]
["Social Housing",null,null,null,null,null,null,null,0,""]
["Capital Spares",null,null,null,null,null,null,null,0,""]
[null,null,null,null,null,null,null,null,null,""]
["Biological or Cultivated Assets",null,{"$f":"SUM(C136:C136)","v":0},0,0,0,0,0,{"$f":"H135-G135","v":0},"",{"$f":"SUM(K136)","v":0}]
["Biological or Cultivated Assets",null,null,null,null,null,null,null,{"$f":"H136-G136","v":0},""]
[null,null,null,null,null,null,null,null,null,""]
["Intangible Assets",null,{"$f":"SUM(C139:C140)","v":0},0,0,0,0,0,{"$f":"H138-G138","v":0},"",{"$f":"SUM(K139:K140)","v":0}]
["Servitudes",null,null,null,null,null,null,null,0,""]
["Licences and Rights",null,{"$f":"SUM(C141:C146)","v":0},0,0,0,0,0,0,"",{"$f":"SUM(K141:K146)","v":0}]
["Water Rights",null,null,null,null,null,null,null,0,""]
["Effluent Licenses",null,null,null,null,null,null,null,0,""]
["Solid Waste Licenses",null,null,null,null,null,null,null,0,""]
["Computer Software and Applications",null,0,0,0,0,0,0,0,"",0]
["Load Settlement Software Applications",null,null,null,null,null,null,null,0,""]
["Unspecified",null,null,null,null,null,null,null,0,""]
[]
["Computer Equipment",null,{"$f":"SUM(C149:C149)","v":0},0,0,0,0,0,{"$f":"H148-G148","v":0},{"$f":"IF(I148=0,\"\",I148/H148)","v":""},{"$f":"SUM(K149)","v":0}]
["Computer Equipment",null,null,null,null,null,null,null,{"$f":"H149-G149","v":0},{"$f":"IF(I149=0,\"\",I149/H149)","v":""}]
[]
["Furniture and Office Equipment",null,{"$f":"SUM(C152:C152)","v":172258.61},300000,300000,0,0,175000,{"$f":"H151-G151","v":175000},{"$f":"IF(I151=0,\"\",I151/H151)","v":1},{"$f":"SUM(K152)","v":300000}]
["Furniture and Office Equipment",null,172258.61,300000,300000,0,0,175000,{"$f":"H152-G152","v":175000},{"$f":"IF(I152=0,\"\",I152/H152)","v":1},300000]
[null,null,null,null,null,null,null,null,null,{"$f":"IF(I153=0,\"\",I153/H153)","v":""}]
["Machinery and Equipment",null,{"$f":"SUM(C155:C155)","v":0},700000,700000,0,54200,408338,{"$f":"H154-G154","v":354138},{"$f":"IF(I154=0,\"\",I154/H154)","v":0.86726682307304248},{"$f":"SUM(K155)","v":700000}]
["Machinery and Equipment",null,0,700000,700000,0,54200,408338,{"$f":"H155-G155","v":354138},{"$f":"IF(I155=0,\"\",I155/H155)","v":0.86726682307304248},700000]
[]
["Transport Assets",null,{"$f":"SUM(C158:C158)","v":0},0,0,0,0,0,{"$f":"H157-G157","v":0},{"$f":"IF(I157=0,\"\",I157/H157)","v":""},{"$f":"SUM(K158)","v":0}]
["Transport Assets",null,null,null,null,null,null,null,{"$f":"H158-G158","v":0},{"$f":"IF(I158=0,\"\",I158/H158)","v":""}]
[]
["Land",null,{"$f":"SUM(C161:C161)","v":0},0,0,0,0,0,{"$f":"H160-G160","v":0},{"$f":"IF(I160=0,\"\",I160/H160)","v":""},{"$f":"SUM(K161)","v":0}]
["Land",null,null,null,null,null,null,null,{"$f":"H161-G161","v":0},{"$f":"IF(I161=0,\"\",I161/H161)","v":""}]
[]
["Zoo's, Marine and Non-biological Animals",null,{"$f":"SUM(C164:C164)","v":0},0,0,0,0,0,{"$f":"H163-G163","v":0},{"$f":"IF(I163=0,\"\",I163/H163)","v":""},{"$f":"SUM(K164)","v":0}]
["Zoo's, Marine and Non-biological Animals",null,null,null,null,null,null,null,{"$f":"H164-G164","v":0},{"$f":"IF(I164=0,\"\",I164/H164)","v":""}]
[null,null,null,null,null,null,null,null,null,{"$f":"IF(I165=0,\"\",I165/H165)","v":""}]
["Total Capital Expenditure on new assets",1,{"$f":"C7+C75+C103+C110+C117+C135+C138+C148+C151+C154+C157+C160+C163","v":11733712.809999999},132648975,132648975,8553748.3000000007,44847290.100000001,77378672,{"$f":"H166-G166","v":32531381.899999999},{"$f":"IF(I166=0,\"\",I166/H166)","v":0.42041794023035184},{"$f":"K7+K75+K103+K110+K117+K135+K138+K148+K151+K154+K157+K160+K163","v":132648975}]
[]
[{"$f":"head27a","v":"References"}]
["1. Total Capital Expenditure on new assets (SC13a) plus Total Capital Expenditure on renewal of existing assets (SC13b) plus Total Capital Expenditure on upgrading of existing assets (SC13e)  must reconcile to total capital expenditure in Table C5"]
[]
["check balance",null,{"$f":"C166+SC13b!C166+SC13e!C166-'C5-Capex'!C40","v":0},{"$f":"D166+SC13b!D166+SC13e!D166-'C5-Capex'!D40","v":0},{"$f":"E166+SC13b!E166+SC13e!E166-'C5-Capex'!E40","v":0},{"$f":"F166+SC13b!F166+SC13e!F166-'C5-Capex'!F40","v":0},{"$f":"G166+SC13b!G166+SC13e!G166-'C5-Capex'!G40","v":0},{"$f":"H166+SC13b!H166+SC13e!H166-'C5-Capex'!H40","v":0},null,null,{"$f":"K166+SC13b!K166+SC13e!K166-'C5-Capex'!K40","v":0}]

{"sheet":"SC13b","index":30,"n_rows":171,"n_cols":11,"rows_kept":171,"cut":false,"hidden":false,"merged":[[0,0,0,10],[1,0,2,0],[1,1,2,1]]}
[{"$f":"muni& \" - \"&S71Sb& \" - \"&Head57","v":"NW375 Moses Kotane - Supporting Table SC13b Monthly Budget Statement - capital expenditure on renewal of existing assets by asset class - M07 January"}]
[{"$f":"desc","v":"Description"},{"$f":"head27","v":"Ref"},{"$f":"Head1","v":"2019/20"},{"$f":"Head2","v":"Budget Year 2020/21"}]
[null,null,{"$f":"Head5","v":"Audited Outcome"},{"$f":"Head6","v":"Original Budget"},{"$f":"Head7","v":"Adjusted Budget"},{"$f":"Head38","v":"Monthly actual"},{"$f":"Head39","v":"YearTD actual"},{"$f":"Head40","v":"YearTD budget"},{"$f":"Head41","v":"YTD variance"},{"$f":"Head41","v":"YTD variance"},{"$f":"Head8","v":"Full Year Forecast"}]
["R thousands",1,null,null,null,null,null,null,null,"%"]
["Capital expenditure on renewal of existing assets by Asset Class/Sub-class"]
[]
["Infrastructure",null,{"$f":"C8+C13+C17+C27+C38+C45+C53+C63+C69","v":9314710.1999999993},0,0,0,0,0,{"$f":"H7-G7","v":0},{"$f":"IF(I7=0,\"\",I7/H7)","v":""},{"$f":"K8+K13+K17+K27+K38+K45+K53+K63+K69","v":0}]
["Roads Infrastructure",null,{"$f":"SUM(C9:C12)","v":0},0,0,0,0,0,0,"",{"$f":"SUM(K9:K12)","v":0}]
["Roads",null,null,null,null,null,null,null,0,""]
["Road Structures",null,null,null,null,null,null,null,0,""]
["Road Furniture",null,null,null,null,null,null,null,0,""]
["Capital Spares",null,null,null,null,null,null,null,0,""]
["Storm water Infrastructure",null,{"$f":"SUM(C14:C16)","v":0},0,0,0,0,0,0,"",{"$f":"SUM(K14:K16)","v":0}]
["Drainage Collection",null,null,null,null,null,null,null,0,""]
["Storm water Conveyance",null,null,null,null,null,null,null,0,""]
["Attenuation",null,null,null,null,null,null,null,0,""]
["Electrical Infrastructure",null,{"$f":"SUM(C18:C26)","v":0},0,0,0,0,0,0,"",{"$f":"SUM(K18:K26)","v":0}]
["Power Plants",null,null,null,null,null,null,null,0,""]
["HV Substations",null,null,null,null,null,null,null,0,""]
["HV Switching Station",null,null,null,null,null,null,null,0,""]
["HV Transmission Conductors",null,null,null,null,null,null,null,0,""]
["MV Substations",null,null,null,null,null,null,null,0,""]
["MV Switching Stations",null,null,null,null,null,null,null,0,""]
["MV Networks",null,null,null,null,null,null,null,0,""]
["LV Networks",null,null,null,null,null,null,null,0,""]
["Capital Spares",null,null,null,null,null,null,null,0,""]
["Water Supply Infrastructure",null,{"$f":"SUM(C28:C37)","v":9314710.1999999993},0,0,0,0,0,0,"",{"$f":"SUM(K28:K37)","v":0}]
["Dams and Weirs",null,null,null,null,null,null,null,0,""]
["Boreholes",null,9314710.1999999993,0,0,0,0,0,0,"",0]
["Reservoirs",null,null,null,null,null,null,null,0,""]
["Pump Stations",null,null,null,null,null,null,null,0,""]
["Water Treatment Works",null,null,null,null,null,null,null,0,""]
["Bulk Mains",null,null,null,null,null,null,null,0,""]
["Distribution",null,null,null,null,null,null,null,0,""]
["Distribution Points",null,null,null,null,null,null,null,0,""]
["PRV Stations",null,null,null,null,null,null,null,0,""]
["Capital Spares",null,null,null,null,null,null,null,0,""]
["Sanitation Infrastructure",null,{"$f":"SUM(C39:C44)","v":0},0,0,0,0,0,0,"",{"$f":"SUM(K39:K44)","v":0}]
["Pump Station",null,null,null,null,null,null,null,0,""]
["Reticulation",null,null,null,null,null,null,null,0,""]
["Waste Water Treatment Works",null,null,null,null,null,null,null,0,""]
["Outfall Sewers",null,null,null,null,null,null,null,0,""]
["Toilet Facilities",null,null,null,null,null,null,null,0,""]
["Capital Spares",null,null,null,null,null,null,null,0,""]
["Solid Waste Infrastructure",null,{"$f":"SUM(C46:C52)","v":0},0,0,0,0,0,0,"",{"$f":"SUM(K46:K52)","v":0}]
["Landfill Sites",null,null,null,null,null,null,null,0,""]
["Waste Transfer Stations",null,null,null,null,null,null,null,0,""]
["Waste Processing Facilities",null,null,null,null,null,null,null,0,""]
["Waste Drop-off Points",null,null,null,null,null,null,null,0,""]
["Waste Separation Facilities",null,null,null,null,null,null,null,0,""]
["Electricity Generation Facilities",null,null,null,null,null,null,null,0,""]
["Capital Spares",null,null,null,null,null,null,null,0,""]
["Rail Infrastructure",null,{"$f":"SUM(C54:C62)","v":0},0,0,0,0,0,0,"",{"$f":"SUM(K54:K62)","v":0}]
["Rail Lines",null,null,null,null,null,null,null,0,""]
["Rail Structures",null,null,null,null,null,null,null,0,""]
["Rail Furniture",null,null,null,null,null,null,null,0,""]
["Drainage Collection",null,null,null,null,null,null,null,0,""]
["Storm water Conveyance",null,null,null,null,null,null,null,0,""]
["Attenuation",null,null,null,null,null,null,null,0,""]
["MV Substations",null,null,null,null,null,null,null,0,""]
["LV Networks",null,null,null,null,null,null,null,0,""]
["Capital Spares",null,null,null,null,null,null,null,0,""]
["Coastal Infrastructure",null,{"$f":"SUM(C64:C68)","v":0},0,0,0,0,0,0,"",{"$f":"SUM(K64:K68)","v":0}]
["Sand Pumps",null,null,null,null,null,null,null,0,""]
["Piers",null,null,null,null,null,null,null,0,""]
["Revetments",null,null,null,null,null,null,null,0,""]
["Promenades",null,null,null,null,null,null,null,0,""]
["Capital Spares",null,null,null,null,null,null,null,0,""]
["Information and Communication Infrastructure",null,{"$f":"SUM(C70:C73)","v":0},0,0,0,0,0,0,"",{"$f":"SUM(K70:K73)","v":0}]
["Data Centres",null,null,null,null,null,null,null,0,""]
["Core Layers",null,null,null,null,null,null,null,0,""]
["Distribution Layers",null,null,null,null,null,null,null,0,""]
["Capital Spares",null,null,null,null,null,null,null,0,""]
[null,null,null,null,null,null,null,null,null,""]
["Community Assets",null,{"$f":"+C76+C99","v":0},9864475,9864475,446541.04,3549672.74,5754280,2204607.2599999998,0.38312478016363466,{"$f":"+K76+K99","v":9864475}]
["Community Facilities",null,{"$f":"SUM(C77:C98)","v":0},9864475,9864475,446541.04,3549672.74,5754280,2204607.2599999998,0.38312478016363466,{"$f":"SUM(K77:K98)","v":9864475}]
["Halls",null,0,9864475,9864475,446541.04,3549672.74,5754280,2204607.2599999998,0.38312478016363466,9864475]
["Centres",null,null,null,null,null,null,null,0,""]
["Crèches",null,null,null,null,null,null,null,0,""]
["Clinics/Care Centres",null,null,null,null,null,null,null,0,""]
["Fire/Ambulance Stations",null,null,null,null,null,null,null,0,""]
["Testing Stations",null,0,0,0,0,0,0,0,"",0]
["Museums",null,null,null,null,null,null,null,0,""]
["Galleries",null,null,null,null,null,null,null,0,""]
["Theatres",null,null,null,null,null,null,null,0,""]
["Libraries",null,null,null,null,null,null,null,0,""]
["Cemeteries/Crematoria",null,null,null,null,null,null,null,0,""]
["Police",null,null,null,null,null,null,null,0,""]
["Purls",null,null,null,null,null,null,null,0,""]
["Public Open Space",null,0,0,0,0,0,0,0,"",0]
["Nature Reserves",null,null,null,null,null,null,null,0,""]
["Public Ablution Facilities",null,null,null,null,null,null,null,0,""]
["Markets",null,null,null,null,null,null,null,0,""]
["Stalls",null,0,0,0,0,0,0,0,"",0]
["Abattoirs",null,null,null,null,null,null,null,0,""]
["Airports",null,null,null,null,null,null,null,0,""]
["Taxi Ranks/Bus Terminals",null,0,0,0,0,0,0,0,"",0]
["Capital Spares",null,null,null,null,null,null,null,0,""]
["Sport and Recreation Facilities",null,{"$f":"SUM(C100:C102)","v":0},0,0,0,0,0,0,"",{"$f":"SUM(K100:K102)","v":0}]
["Indoor Facilities",null,null,null,null,null,null,null,0,""]
["Outdoor Facilities",null,null,null,null,null,null,null,{"$f":"H101-G101","v":0},{"$f":"IF(I101=0,\"\",I101/H101)","v":""}]
["Capital Spares",null,null,null,null,null,null,null,0,""]
["Heritage assets",null,{"$f":"SUM(C104:C108)","v":0},0,0,0,0,0,0,"",{"$f":"SUM(K104:K108)","v":0}]
["Monuments",null,null,null,null,null,null,null,0,""]
["Historic Buildings",null,null,null,null,null,null,null,0,""]
["Works of Art",null,null,null,null,null,null,null,0,""]
["Conservation Areas",null,null,null,null,null,null,null,0,""]
["Other Heritage",null,null,null,null,null,null,null,0,""]
[null,null,null,null,null,null,null,null,0,""]
["Investment properties",null,{"$f":"+C111+C114","v":0},0,0,0,0,0,0,"",{"$f":"+K111+K114","v":0}]
["Revenue Generating",null,{"$f":"SUM(C112:C113)","v":0},0,0,0,0,0,0,"",{"$f":"SUM(K112:K113)","v":0}]
["Improved Property",null,null,null,null,null,null,null,0,""]
["Unimproved Property",null,null,null,null,null,null,null,0,""]
["Non-revenue Generating",null,{"$f":"SUM(C115:C116)","v":0},0,0,0,0,0,0,"",{"$f":"SUM(K115:K116)","v":0}]
["Improved Property",null,null,null,null,null,null,null,0,""]
["Unimproved Property",null,null,null,null,null,null,null,{"$f":"H116-G116","v":0},{"$f":"IF(I116=0,\"\",I116/H116)","v":""}]
["Other assets",null,{"$f":"+C118+C130","v":0},0,0,443010.79,882928.33,0,-882928.33,{"$error":"#DIV/0!"},{"$f":"+K118+K130","v":0}]
["Operational Buildings",null,{"$f":"SUM(C119:C129)","v":0},0,0,443010.79,882928.33,0,-882928.33,{"$error":"#DIV/0!"},{"$f":"SUM(K119:K129)","v":0}]
["Municipal Offices",null,0,0,0,0,0,0,0,"",0]
["Pay/Enquiry Points",null,null,null,null,null,null,null,0,""]
["Building Plan Offices",null,null,null,null,null,null,null,0,""]
["Workshops",null,null,null,null,null,null,null,0,""]
["Yards",null,null,null,null,null,null,null,0,""]
["Stores",null,0,0,0,443010.79,882928.33,0,-882928.33,{"$error":"#DIV/0!"},0]
["Laboratories",null,null,null,null,null,null,null,0,""]
["Training Centres",null,null,null,null,null,null,null,0,""]
["Manufacturing Plant",null,null,null,null,null,null,null,0,""]
["Depots",null,null,null,null,null,null,null,0,""]
["Capital Spares",null,null,null,null,null,null,null,0,""]
["Housing",null,{"$f":"SUM(C131:C133)","v":0},0,0,0,0,0,0,"",{"$f":"SUM(K131:K133)","v":0}]
["Staff Housing",null,null,null,null,null,null,null,0,""]
["Social Housing",null,null,null,null,null,null,null,0,""]
["Capital Spares",null,null,null,null,null,null,null,0,""]
[null,null,null,null,null,null,null,null,null,""]
["Biological or Cultivated Assets",null,{"$f":"SUM(C136:C136)","v":0},0,0,0,0,0,{"$f":"H135-G135","v":0},"",{"$f":"SUM(K136)","v":0}]
["Biological or Cultivated Assets",null,null,null,null,null,null,null,{"$f":"H136-G136","v":0},""]
[null,null,null,null,null,null,null,null,null,{"$f":"IF(I137=0,\"\",I137/H137)","v":""}]
["Intangible Assets",null,{"$f":"SUM(C139:C140)","v":0},0,0,0,0,0,{"$f":"H138-G138","v":0},"",{"$f":"SUM(K139:K140)","v":0}]
["Servitudes",null,null,null,null,null,null,null,0,""]
["Licences and Rights",null,{"$f":"SUM(C141:C146)","v":0},0,0,0,0,0,0,"",{"$f":"SUM(K141:K146)","v":0}]
["Water Rights",null,null,null,null,null,null,null,0,""]
["Effluent Licenses",null,null,null,null,null,null,null,0,""]
["Solid Waste Licenses",null,null,null,null,null,null,null,0,""]
["Computer Software and Applications",null,0,0,0,0,0,0,0,"",0]
["Load Settlement Software Applications",null,null,null,null,null,null,null,0,""]
["Unspecified",null,null,null,null,null,null,null,0,""]
[]
["Computer Equipment",null,{"$f":"SUM(C149:C149)","v":0},0,0,0,0,0,{"$f":"H148-G148","v":0},{"$f":"IF(I148=0,\"\",I148/H148)","v":""},{"$f":"SUM(K149)","v":0}]
["Computer Equipment",null,null,null,null,null,null,null,{"$f":"H149-G149","v":0},{"$f":"IF(I149=0,\"\",I149/H149)","v":""}]
[]
["Furniture and Office Equipment",null,{"$f":"SUM(C152:C152)","v":0},0,0,0,0,0,{"$f":"H151-G151","v":0},{"$f":"IF(I151=0,\"\",I151/H151)","v":""},{"$f":"SUM(K152)","v":0}]
["Furniture and Office Equipment",null,null,null,null,null,null,null,{"$f":"H152-G152","v":0},{"$f":"IF(I152=0,\"\",I152/H152)","v":""}]
[null,null,null,null,null,null,null,null,null,{"$f":"IF(I153=0,\"\",I153/H153)","v":""}]
["Machinery and Equipment",null,{"$f":"SUM(C155:C155)","v":0},0,0,0,0,0,{"$f":"H154-G154","v":0},{"$f":"IF(I154=0,\"\",I154/H154)","v":""},{"$f":"SUM(K155)","v":0}]
["Machinery and Equipment",null,null,null,null,null,null,null,{"$f":"H155-G155","v":0},{"$f":"IF(I155=0,\"\",I155/H155)","v":""}]
[]
["Transport Assets",null,{"$f":"SUM(C158:C158)","v":0},0,0,0,0,0,{"$f":"H157-G157","v":0},{"$f":"IF(I157=0,\"\",I157/H157)","v":""},{"$f":"SUM(K158)","v":0}]
["Transport Assets",null,null,null,null,null,null,null,{"$f":"H158-G158","v":0},{"$f":"IF(I158=0,\"\",I158/H158)","v":""}]
[]
["Land",null,{"$f":"SUM(C161:C161)","v":0},0,0,0,0,0,{"$f":"H160-G160","v":0},{"$f":"IF(I160=0,\"\",I160/H160)","v":""},{"$f":"SUM(K161)","v":0}]
["Land",null,null,null,null,null,null,null,{"$f":"H161-G161","v":0},{"$f":"IF(I161=0,\"\",I161/H161)","v":""}]
[null,null,null,null,null,null,null,null,null,"."]
["Zoo's, Marine and Non-biological Animals",null,{"$f":"SUM(C164:C164)","v":0},0,0,0,0,0,{"$f":"H163-G163","v":0},{"$f":"IF(I163=0,\"\",I163/H163)","v":""},{"$f":"SUM(K164)","v":0}]
["Zoo's, Marine and Non-biological Animals",null,null,null,null,null,null,null,{"$f":"H164-G164","v":0},{"$f":"IF(I164=0,\"\",I164/H164)","v":""}]
[null,null,null,null,null,null,null,null,null,{"$f":"IF(I165=0,\"\",I165/H165)","v":""}]
["Total Capital Expenditure on renewal of existing assets ",1,{"$f":"C7+C75+C103+C110+C117+C135+C138+C148+C151+C154+C157+C160+C163","v":9314710.1999999993},9864475,9864475,889551.83,4432601.07,5754280,{"$f":"H166-G166","v":1321678.9299999997},{"$f":"IF(I166=0,\"\",I166/H166)","v":0.22968623876488453},{"$f":"K7+K75+K103+K110+K117+K135+K138+K148+K151+K154+K157+K160+K163","v":9864475}]
[]
[{"$f":"head27a","v":"References"}]
["1. Total Capital Expenditure on new assets (SC13a) plus Total Capital Expenditure on renewal of existing assets (SC13b) plus Total Capital Expenditure on upgrading of existing assets (SC13e) must reconcile to total capital expenditure in Table C5"]
[]
["check balance",null,{"$f":"C166+SC13a!C166+SC13e!C166-'C5-Capex'!C40","v":0},{"$f":"D166+SC13a!D166+SC13e!D166-'C5-Capex'!D40","v":0},{"$f":"E166+SC13a!E166+SC13e!E166-'C5-Capex'!E40","v":0},{"$f":"F166+SC13a!F166+SC13e!F166-'C5-Capex'!F40","v":0},{"$f":"G166+SC13a!G166+SC13e!G166-'C5-Capex'!G40","v":0},{"$f":"H166+SC13a!H166+SC13e!H166-'C5-Capex'!H40","v":0},null,null,{"$f":"K166+SC13a!K166+SC13e!K166-'C5-Capex'!K40","v":0}]

{"sheet":"SC13c","index":31,"n_rows":166,"n_cols":11,"rows_kept":166,"cut":false,"hidden":false,"merged":[[0,0,0,10],[1,0,2,0],[1,1,2,1]]}
[{"$f":"muni& \" - \"&S71Sc& \" - \"&Head57","v":"NW375 Moses Kotane - Supporting Table SC13c Monthly Budget Statement - expenditure on repairs and maintenance by asset class - M07 January"}]
[{"$f":"desc","v":"Description"},{"$f":"head27","v":"Ref"},{"$f":"Head1","v":"2019/20"},{"$f":"Head2","v":"Budget Year 2020/21"}]
[null,null,{"$f":"Head5","v":"Audited Outcome"},{"$f":"Head6","v":"Original Budget"},{"$f":"Head7","v":"Adjusted Budget"},{"$f":"Head38","v":"Monthly actual"},{"$f":"Head39","v":"YearTD actual"},{"$f":"Head40","v":"YearTD budget"},{"$f":"Head41","v":"YTD variance"},{"$f":"Head41","v":"YTD variance"},{"$f":"Head8","v":"Full Year Forecast"}]
["R thousands",1,null,null,null,null,null,null,null,"%"]
["Repairs and maintenance expenditure by Asset Class/Sub-class"]
[]
["Infrastructure",null,{"$f":"C8+C13+C17+C27+C38+C45+C53+C63+C69","v":29460361.399999999},20270000,25910817,960061.04,29263893.600000001,14644619.5,{"$f":"H7-G7","v":-14619274.100000001},{"$f":"IF(I7=0,\"\",I7/H7)","v":-0.99826930293409133},{"$f":"K8+K13+K17+K27+K38+K45+K53+K63+K69","v":25910817}]
["Roads Infrastructure",null,{"$f":"SUM(C9:C12)","v":414820.5},1100000,1100000,24747.5,628032.88,641676,13643.119999999995,2.1261695933773424E-2,{"$f":"SUM(K9:K12)","v":1100000}]
["Roads",null,414820.5,1000000,1000000,24747.5,628032.88,583338,-44694.880000000005,-7.6619181332263642E-2,1000000]
["Road Structures",null,null,null,null,null,null,null,0,""]
["Road Furniture",null,0,100000,100000,0,0,58338,58338,1,100000]
["Capital Spares",null,null,null,null,null,null,null,0,""]
["Storm water Infrastructure",null,{"$f":"SUM(C14:C16)","v":32511.78},760000,760000,0,57318,443338,386020,0.87071263911507701,{"$f":"SUM(K14:K16)","v":760000}]
["Drainage Collection",null,null,null,null,null,null,null,0,""]
["Storm water Conveyance",null,32511.78,760000,760000,0,57318,443338,386020,0.87071263911507701,760000]
["Attenuation",null,null,null,null,null,null,null,0,""]
["Electrical Infrastructure",null,{"$f":"SUM(C18:C26)","v":244640.08},1000000,1000000,0,804550.3,583338,-221212.30000000005,-0.37921805196987002,{"$f":"SUM(K18:K26)","v":1000000}]
["Power Plants",null,null,null,null,null,null,null,0,""]
["HV Substations",null,null,null,null,null,null,null,0,""]
["HV Switching Station",null,null,null,null,null,null,null,0,""]
["HV Transmission Conductors",null,null,null,null,null,null,null,0,""]
["MV Substations",null,null,null,null,null,null,null,0,""]
["MV Switching Stations",null,null,null,null,null,null,null,0,""]
["MV Networks",null,null,null,null,null,null,null,0,""]
["LV Networks",null,244640.08,1000000,1000000,0,804550.3,583338,-221212.30000000005,-0.37921805196987002,1000000]
["Capital Spares",null,null,null,null,null,null,null,0,""]
["Water Supply Infrastructure",null,{"$f":"SUM(C28:C37)","v":68879.95},200000,200000,0,1029578.4,116669,-912909.4,-7.8247812186613412,{"$f":"SUM(K28:K37)","v":200000}]
["Dams and Weirs",null,null,null,null,null,null,null,0,""]
["Boreholes",null,null,null,null,null,null,null,0,""]
["Reservoirs",null,68879.95,200000,200000,0,1029578.4,116669,-912909.4,-7.8247812186613412,200000]
["Pump Stations",null,null,null,null,null,null,null,0,""]
["Water Treatment Works",null,null,null,null,null,null,null,0,""]
["Bulk Mains",null,null,null,null,null,null,null,0,""]
["Distribution",null,null,null,null,null,null,null,0,""]
["Distribution Points",null,null,null,null,null,null,null,0,""]
["PRV Stations",null,null,null,null,null,null,null,0,""]
["Capital Spares",null,null,null,null,null,null,null,0,""]
["Sanitation Infrastructure",null,{"$f":"SUM(C39:C44)","v":0},0,0,0,0,0,0,"",{"$f":"SUM(K39:K44)","v":0}]
["Pump Station",null,null,null,null,null,null,null,0,""]
["Reticulation",null,null,null,null,null,null,null,0,""]
["Waste Water Treatment Works",null,null,null,null,null,null,null,0,""]
["Outfall Sewers",null,null,null,null,null,null,null,0,""]
["Toilet Facilities",null,null,null,null,null,null,null,0,""]
["Capital Spares",null,null,null,null,null,null,null,0,""]
["Solid Waste Infrastructure",null,{"$f":"SUM(C46:C52)","v":28699509.09},17210000,22850817,935313.54,26744414.02,12859598.5,-13884815.52,-1.0797238747383908,{"$f":"SUM(K46:K52)","v":22850817}]
["Landfill Sites",null,28699509.09,17210000,22850817,935313.54,26744414.02,12859598.5,-13884815.52,-1.0797238747383908,22850817]
["Waste Transfer Stations",null,0,0,0,0,0,0,0,"",0]
["Waste Processing Facilities",null,null,null,null,null,null,null,0,""]
["Waste Drop-off Points",null,null,null,null,null,null,null,0,""]
["Waste Separation Facilities",null,null,null,null,null,null,null,0,""]
["Electricity Generation Facilities",null,null,null,null,null,null,null,0,""]
["Capital Spares",null,null,null,null,null,null,null,0,""]
["Rail Infrastructure",null,{"$f":"SUM(C54:C62)","v":0},0,0,0,0,0,0,"",{"$f":"SUM(K54:K62)","v":0}]
["Rail Lines",null,null,null,null,null,null,null,0,""]
["Rail Structures",null,null,null,null,null,null,null,0,""]
["Rail Furniture",null,null,null,null,null,null,null,0,""]
["Drainage Collection",null,null,null,null,null,null,null,0,""]
["Storm water Conveyance",null,null,null,null,null,null,null,0,""]
["Attenuation",null,null,null,null,null,null,null,0,""]
["MV Substations",null,null,null,null,null,null,null,0,""]
["LV Networks",null,null,null,null,null,null,null,0,""]
["Capital Spares",null,null,null,null,null,null,null,0,""]
["Coastal Infrastructure",null,{"$f":"SUM(C64:C68)","v":0},0,0,0,0,0,0,"",{"$f":"SUM(K64:K68)","v":0}]
["Sand Pumps",null,null,null,null,null,null,null,0,""]
["Piers",null,null,null,null,null,null,null,0,""]
["Revetments",null,null,null,null,null,null,null,0,""]
["Promenades",null,null,null,null,null,null,null,0,""]
["Capital Spares",null,null,null,null,null,null,null,0,""]
["Information and Communication Infrastructure",null,{"$f":"SUM(C70:C73)","v":0},0,0,0,0,0,0,"",{"$f":"SUM(K70:K73)","v":0}]
["Data Centres",null,null,null,null,null,null,null,0,""]
["Core Layers",null,null,null,null,null,null,null,0,""]
["Distribution Layers",null,null,null,null,null,null,null,0,""]
["Capital Spares",null,null,null,null,null,null,null,0,""]
[null,null,null,null,null,null,null,null,null,""]
["Community Assets",null,{"$f":"+C76+C99","v":23890.59},200000,200000,28950,54675,116669,61994,0.53136651552683234,{"$f":"+K76+K99","v":200000}]
["Community Facilities",null,{"$f":"SUM(C77:C98)","v":0},0,0,0,0,0,0,"",{"$f":"SUM(K77:K98)","v":0}]
["Halls",null,null,null,null,null,null,null,0,""]
["Centres",null,null,null,null,null,null,null,0,""]
["Crèches",null,null,null,null,null,null,null,0,""]
["Clinics/Care Centres",null,null,null,null,null,null,null,0,""]
["Fire/Ambulance Stations",null,null,null,null,null,null,null,0,""]
["Testing Stations",null,0,0,0,0,0,0,0,"",0]
["Museums",null,null,null,null,null,null,null,0,""]
["Galleries",null,null,null,null,null,null,null,0,""]
["Theatres",null,null,null,null,null,null,null,0,""]
["Libraries",null,null,null,null,null,null,null,0,""]
["Cemeteries/Crematoria",null,0,0,0,0,0,0,0,"",0]
["Police",null,null,null,null,null,null,null,0,""]
["Purls",null,null,null,null,null,null,null,0,""]
["Public Open Space",null,null,null,null,null,null,null,0,""]
["Nature Reserves",null,null,null,null,null,null,null,0,""]
["Public Ablution Facilities",null,null,null,null,null,null,null,0,""]
["Markets",null,null,null,null,null,null,null,0,""]
["Stalls",null,null,null,null,null,null,null,0,""]
["Abattoirs",null,null,null,null,null,null,null,0,""]
["Airports",null,null,null,null,null,null,null,0,""]
["Taxi Ranks/Bus Terminals",null,null,null,null,null,null,null,0,""]
["Capital Spares",null,null,null,null,null,null,null,0,""]
["Sport and Recreation Facilities",null,{"$f":"SUM(C100:C102)","v":23890.59},200000,200000,28950,54675,116669,61994,0.53136651552683234,{"$f":"SUM(K100:K102)","v":200000}]
["Indoor Facilities",null,null,null,null,null,null,null,0,""]
["Outdoor Facilities",null,23890.59,200000,200000,28950,54675,116669,{"$f":"H101-G101","v":61994},{"$f":"IF(I101=0,\"\",I101/H101)","v":0.53136651552683234},200000]
["Capital Spares",null,null,null,null,null,null,null,0,""]
["Heritage assets",null,{"$f":"SUM(C104:C108)","v":0},0,0,0,0,0,0,"",{"$f":"SUM(K104:K108)","v":0}]
["Monuments",null,null,null,null,null,null,null,0,""]
["Historic Buildings",null,null,null,null,null,null,null,0,""]
["Works of Art",null,null,null,null,null,null,null,0,""]
["Conservation Areas",null,null,null,null,null,null,null,0,""]
["Other Heritage",null,null,null,null,null,null,null,0,""]
[null,null,null,null,null,null,null,null,0,""]
["Investment properties",null,{"$f":"+C111+C114","v":0},0,0,0,0,0,0,"",{"$f":"+K111+K114","v":0}]
["Revenue Generating",null,{"$f":"SUM(C112:C113)","v":0},0,0,0,0,0,0,"",{"$f":"SUM(K112:K113)","v":0}]
["Improved Property",null,null,null,null,null,null,null,0,""]
["Unimproved Property",null,null,null,null,null,null,null,0,""]
["Non-revenue Generating",null,{"$f":"SUM(C115:C116)","v":0},0,0,0,0,0,0,"",{"$f":"SUM(K115:K116)","v":0}]
["Improved Property",null,null,null,null,null,null,null,0,""]
["Unimproved Property",null,null,null,null,null,null,null,{"$f":"H116-G116","v":0},{"$f":"IF(I116=0,\"\",I116/H116)","v":""}]
["Other assets",null,{"$f":"+C118+C130","v":4175675.64},4500000,5446000,-11138.78,1941067.86,3098007,1156939.1399999999,0.37344626400134018,{"$f":"+K118+K130","v":5446000}]
["Operational Buildings",null,{"$f":"SUM(C119:C129)","v":4175675.64},4500000,5446000,-11138.78,1941067.86,3098007,1156939.1399999999,0.37344626400134018,{"$f":"SUM(K119:K129)","v":5446000}]
["Municipal Offices",null,4175675.64,4500000,5446000,-11138.78,1941067.86,3098007,1156939.1399999999,0.37344626400134018,5446000]
["Pay/Enquiry Points",null,null,null,null,null,null,null,0,""]
["Building Plan Offices",null,null,null,null,null,null,null,0,""]
["Workshops",null,null,null,null,null,null,null,0,""]
["Yards",null,null,null,null,null,null,null,0,""]
["Stores",null,null,null,null,null,null,null,0,""]
["Laboratories",null,null,null,null,null,null,null,0,""]
["Training Centres",null,null,null,null,null,null,null,0,""]
["Manufacturing Plant",null,null,null,null,null,null,null,0,""]
["Depots",null,null,null,null,null,null,null,0,""]
["Capital Spares",null,null,null,null,null,null,null,0,""]
["Housing",null,{"$f":"SUM(C131:C133)","v":0},0,0,0,0,0,0,"",{"$f":"SUM(K131:K133)","v":0}]
["Staff Housing",null,null,null,null,null,null,null,0,""]
["Social Housing",null,null,null,null,null,null,null,0,""]
["Capital Spares",null,null,null,null,null,null,null,0,""]
[null,null,null,null,null,null,null,null,null,""]
["Biological or Cultivated Assets",null,{"$f":"SUM(C136:C136)","v":0},0,0,0,0,0,{"$f":"H135-G135","v":0},"",{"$f":"SUM(K136)","v":0}]
["Biological or Cultivated Assets",null,null,null,null,null,null,null,{"$f":"H136-G136","v":0},""]
[null,null,null,null,null,null,null,null,null,{"$f":"IF(I137=0,\"\",I137/H137)","v":""}]
["Intangible Assets",null,{"$f":"SUM(C139:C140)","v":758452.76},0,0,0,0,0,{"$f":"H138-G138","v":0},"",{"$f":"SUM(K139:K140)","v":0}]
["Servitudes",null,null,null,null,null,null,null,0,""]
["Licences and Rights",null,{"$f":"SUM(C141:C146)","v":758452.76},0,0,0,0,0,0,"",{"$f":"SUM(K141:K146)","v":0}]
["Water Rights",null,null,null,null,null,null,null,0,""]
["Effluent Licenses",null,null,null,null,null,null,null,0,""]
["Solid Waste Licenses",null,null,null,null,null,null,null,0,""]
["Computer Software and Applications",null,758452.76,0,0,0,0,0,0,"",0]
["Load Settlement Software Applications",null,null,null,null,null,null,null,0,""]
["Unspecified",null,null,null,null,null,null,null,0,""]
[]
["Computer Equipment",null,{"$f":"SUM(C149:C149)","v":3887},50000,50000,0,5735,29169,{"$f":"H148-G148","v":23434},{"$f":"IF(I148=0,\"\",I148/H148)","v":0.80338715759882062},{"$f":"SUM(K149)","v":50000}]
["Computer Equipment",null,3887,50000,50000,0,5735,29169,{"$f":"H149-G149","v":23434},{"$f":"IF(I149=0,\"\",I149/H149)","v":0.80338715759882062},50000]
[]
["Furniture and Office Equipment",null,{"$f":"SUM(C152:C152)","v":0},0,0,0,0,0,{"$f":"H151-G151","v":0},{"$f":"IF(I151=0,\"\",I151/H151)","v":""},{"$f":"SUM(K152)","v":0}]
["Furniture and Office Equipment",null,null,null,null,null,null,null,{"$f":"H152-G152","v":0},{"$f":"IF(I152=0,\"\",I152/H152)","v":""}]
[null,null,null,null,null,null,null,null,null,{"$f":"IF(I153=0,\"\",I153/H153)","v":""}]
["Machinery and Equipment",null,{"$f":"SUM(C155:C155)","v":0},0,0,0,0,0,{"$f":"H154-G154","v":0},{"$f":"IF(I154=0,\"\",I154/H154)","v":""},{"$f":"SUM(K155)","v":0}]
["Machinery and Equipment",null,0,0,0,0,0,0,{"$f":"H155-G155","v":0},{"$f":"IF(I155=0,\"\",I155/H155)","v":""},0]
[]
["Transport Assets",null,{"$f":"SUM(C158:C158)","v":11382320.949999999},6160000,6160000,-55707.39,5287299.17,3593345,{"$f":"H157-G157","v":-1693954.17},{"$f":"IF(I157=0,\"\",I157/H157)","v":-0.47141428668830848},{"$f":"SUM(K158)","v":6160000}]
["Transport Assets",null,11382320.949999999,6160000,6160000,-55707.39,5287299.17,3593345,{"$f":"H158-G158","v":-1693954.17},{"$f":"IF(I158=0,\"\",I158/H158)","v":-0.47141428668830848},6160000]
[]
["Land",null,{"$f":"SUM(C161:C161)","v":0},0,0,0,0,0,{"$f":"H160-G160","v":0},{"$f":"IF(I160=0,\"\",I160/H160)","v":""},{"$f":"SUM(K161)","v":0}]
["Land",null,null,null,null,null,null,null,{"$f":"H161-G161","v":0},{"$f":"IF(I161=0,\"\",I161/H161)","v":""}]
[]
["Zoo's, Marine and Non-biological Animals",null,{"$f":"SUM(C164:C164)","v":0},0,0,0,0,0,{"$f":"H163-G163","v":0},{"$f":"IF(I163=0,\"\",I163/H163)","v":""},{"$f":"SUM(K164)","v":0}]
["Zoo's, Marine and Non-biological Animals",null,null,null,null,null,null,null,{"$f":"H164-G164","v":0},{"$f":"IF(I164=0,\"\",I164/H164)","v":""}]
[null,null,null,null,null,null,null,null,null,{"$f":"IF(I165=0,\"\",I165/H165)","v":""}]
["Total Repairs and Maintenance Expenditure",1,{"$f":"C7+C75+C103+C110+C117+C135+C138+C148+C151+C154+C157+C160+C163","v":45804588.339999989},31180000,37766817,922164.87,36552670.630000003,21481809.5,-15070861.130000003,-0.70156385708568925,{"$f":"K7+K75+K103+K110+K117+K135+K138+K148+K151+K154+K157+K160+K163","v":37766817}]

{"sheet":"SC13d","index":32,"n_rows":166,"n_cols":11,"rows_kept":166,"cut":false,"hidden":false,"merged":[[0,0,0,10],[1,0,2,0],[1,1,2,1]]}
[{"$f":"muni& \" - \"&S71Sd& \" - \"&Head57","v":"NW375 Moses Kotane - Supporting Table SC13d Monthly Budget Statement - depreciation by asset class - M07 January"}]
[{"$f":"desc","v":"Description"},{"$f":"head27","v":"Ref"},{"$f":"Head1","v":"2019/20"},{"$f":"Head2","v":"Budget Year 2020/21"}]
[null,null,{"$f":"Head5","v":"Audited Outcome"},{"$f":"Head6","v":"Original Budget"},{"$f":"Head7","v":"Adjusted Budget"},{"$f":"Head38","v":"Monthly actual"},{"$f":"Head39","v":"YearTD actual"},{"$f":"Head40","v":"YearTD budget"},{"$f":"Head41","v":"YTD variance"},{"$f":"Head41","v":"YTD variance"},{"$f":"Head8","v":"Full Year Forecast"}]
["R thousands",1,null,null,null,null,null,null,null,"%"]
["Depreciation by Asset Class/Sub-class"]
[]
["Infrastructure",null,{"$f":"C8+C13+C17+C27+C38+C45+C53+C63+C69","v":89735745.870000005},5849303,5849303,59646974.310000002,59646974.310000002,3412101,{"$f":"H7-G7","v":-56234873.310000002},{"$f":"IF(I7=0,\"\",I7/H7)","v":-16.481010764335522},{"$f":"K8+K13+K17+K27+K38+K45+K53+K63+K69","v":5849303}]
["Roads Infrastructure",null,{"$f":"SUM(C9:C12)","v":37515117.130000003},0,0,27924963.5,27924963.5,0,-27924963.5,{"$error":"#DIV/0!"},{"$f":"SUM(K9:K12)","v":0}]
["Roads",null,37515117.130000003,0,0,27924963.5,27924963.5,0,-27924963.5,{"$error":"#DIV/0!"},0]
["Road Structures",null,0,0,0,0,0,0,0,"",0]
["Road Furniture",null,0,0,0,0,0,0,0,"",0]
["Capital Spares",null,0,0,0,0,0,0,0,"",0]
["Storm water Infrastructure",null,{"$f":"SUM(C14:C16)","v":3119061.48},0,0,3250975,3250975,0,-3250975,{"$error":"#DIV/0!"},{"$f":"SUM(K14:K16)","v":0}]
["Drainage Collection",null,3119061.48,0,0,3250975,3250975,0,-3250975,{"$error":"#DIV/0!"},0]
["Storm water Conveyance",null,0,0,0,0,0,0,0,"",0]
["Attenuation",null,0,0,0,0,0,0,0,"",0]
["Electrical Infrastructure",null,{"$f":"SUM(C18:C26)","v":2922340.45},2515474,2515474,1467359.81,1467359.81,1467361,1.1899999999441206,8.1097971115773187E-7,{"$f":"SUM(K18:K26)","v":2515474}]
["Power Plants",null,2922340.45,2515474,2515474,1467359.81,1467359.81,1467361,1.1899999999441206,8.1097971115773187E-7,2515474]
["HV Substations",null,0,0,0,0,0,0,0,"",0]
["HV Switching Station",null,0,0,0,0,0,0,0,"",0]
["HV Transmission Conductors",null,0,0,0,0,0,0,0,"",0]
["MV Substations",null,0,0,0,0,0,0,0,"",0]
["MV Switching Stations",null,0,0,0,0,0,0,0,"",0]
["MV Networks",null,0,0,0,0,0,0,0,"",0]
["LV Networks",null,0,0,0,0,0,0,0,"",0]
["Capital Spares",null,0,0,0,0,0,0,0,"",0]
["Water Supply Infrastructure",null,{"$f":"SUM(C28:C37)","v":42465387.619999997},0,0,25058942.440000001,25058942.440000001,0,-25058942.440000001,{"$error":"#DIV/0!"},{"$f":"SUM(K28:K37)","v":0}]
["Dams and Weirs",null,0,0,0,0,0,0,0,"",0]
["Boreholes",null,0,0,0,0,0,0,0,"",0]
["Reservoirs",null,0,0,0,0,0,0,0,"",0]
["Pump Stations",null,0,0,0,0,0,0,0,"",0]
["Water Treatment Works",null,0,0,0,0,0,0,0,"",0]
["Bulk Mains",null,0,0,0,0,0,0,0,"",0]
["Distribution",null,42465387.619999997,0,0,25058942.440000001,25058942.440000001,0,-25058942.440000001,{"$error":"#DIV/0!"},0]
["Distribution Points",null,0,0,0,0,0,0,0,"",0]
["PRV Stations",null,0,0,0,0,0,0,0,"",0]
["Capital Spares",null,0,0,0,0,0,0,0,"",0]
["Sanitation Infrastructure",null,{"$f":"SUM(C39:C44)","v":2754188.32},2785714,2785714,1624999.81,1624999.81,1625001,1.1899999999441206,7.3230724162269476E-7,{"$f":"SUM(K39:K44)","v":2785714}]
["Pump Station",null,0,0,0,0,0,0,0,"",0]
["Reticulation",null,0,0,0,0,0,0,0,"",0]
["Waste Water Treatment Works",null,2754188.32,2785714,2785714,1624999.81,1624999.81,1625001,1.1899999999441206,7.3230724162269476E-7,2785714]
["Outfall Sewers",null,0,0,0,0,0,0,0,"",0]
["Toilet Facilities",null,0,0,0,0,0,0,0,"",0]
["Capital Spares",null,0,0,0,0,0,0,0,"",0]
["Solid Waste Infrastructure",null,{"$f":"SUM(C46:C52)","v":959650.87},548115,548115,319733.75,319733.75,319739,5.25,1.6419642270727061E-5,{"$f":"SUM(K46:K52)","v":548115}]
["Landfill Sites",null,959650.87,548115,548115,319733.75,319733.75,319739,5.25,1.6419642270727061E-5,548115]
["Waste Transfer Stations",null,0,0,0,0,0,0,0,"",0]
["Waste Processing Facilities",null,0,0,0,0,0,0,0,"",0]
["Waste Drop-off Points",null,0,0,0,0,0,0,0,"",0]
["Waste Separation Facilities",null,0,0,0,0,0,0,0,"",0]
["Electricity Generation Facilities",null,0,0,0,0,0,0,0,"",0]
["Capital Spares",null,0,0,0,0,0,0,0,"",0]
["Rail Infrastructure",null,{"$f":"SUM(C54:C62)","v":0},0,0,0,0,0,0,"",{"$f":"SUM(K54:K62)","v":0}]
["Rail Lines",null,null,null,null,null,null,null,0,""]
["Rail Structures",null,null,null,null,null,null,null,0,""]
["Rail Furniture",null,null,null,null,null,null,null,0,""]
["Drainage Collection",null,null,null,null,null,null,null,0,""]
["Storm water Conveyance",null,null,null,null,null,null,null,0,""]
["Attenuation",null,null,null,null,null,null,null,0,""]
["MV Substations",null,null,null,null,null,null,null,0,""]
["LV Networks",null,null,null,null,null,null,null,0,""]
["Capital Spares",null,null,null,null,null,null,null,0,""]
["Coastal Infrastructure",null,{"$f":"SUM(C64:C68)","v":0},0,0,0,0,0,0,"",{"$f":"SUM(K64:K68)","v":0}]
["Sand Pumps",null,null,null,null,null,null,null,0,""]
["Piers",null,null,null,null,null,null,null,0,""]
["Revetments",null,null,null,null,null,null,null,0,""]
["Promenades",null,null,null,null,null,null,null,0,""]
["Capital Spares",null,null,null,null,null,null,null,0,""]
["Information and Communication Infrastructure",null,{"$f":"SUM(C70:C73)","v":0},0,0,0,0,0,0,"",{"$f":"SUM(K70:K73)","v":0}]
["Data Centres",null,null,null,null,null,null,null,0,""]
["Core Layers",null,null,null,null,null,null,null,0,""]
["Distribution Layers",null,null,null,null,null,null,null,0,""]
["Capital Spares",null,null,null,null,null,null,null,0,""]
[null,null,null,null,null,null,null,null,null,""]
["Community Assets",null,{"$f":"+C76+C99","v":19581208.73},17007132,17007132,6504185.9400000004,6504185.9400000004,9920827,3416641.0599999996,0.34439075089203747,{"$f":"+K76+K99","v":17007132}]
["Community Facilities",null,{"$f":"SUM(C77:C98)","v":19581208.73},17007132,17007132,6504185.9400000004,6504185.9400000004,9920827,3416641.0599999996,0.34439075089203747,{"$f":"SUM(K77:K98)","v":17007132}]
["Halls",null,15998476.369999999,17007132,17007132,0,0,9920827,9920827,1,17007132]
["Centres",null,3582732.36,0,0,6504185.9400000004,6504185.9400000004,0,-6504185.9400000004,{"$error":"#DIV/0!"},0]
["Crèches",null,0,0,0,0,0,0,0,"",0]
["Clinics/Care Centres",null,0,0,0,0,0,0,0,"",0]
["Fire/Ambulance Stations",null,0,0,0,0,0,0,0,"",0]
["Testing Stations",null,0,0,0,0,0,0,0,"",0]
["Museums",null,0,0,0,0,0,0,0,"",0]
["Galleries",null,0,0,0,0,0,0,0,"",0]
["Theatres",null,0,0,0,0,0,0,0,"",0]
["Libraries",null,0,0,0,0,0,0,0,"",0]
["Cemeteries/Crematoria",null,0,0,0,0,0,0,0,"",0]
["Police",null,0,0,0,0,0,0,0,"",0]
["Purls",null,0,0,0,0,0,0,0,"",0]
["Public Open Space",null,0,0,0,0,0,0,0,"",0]
["Nature Reserves",null,0,0,0,0,0,0,0,"",0]
["Public Ablution Facilities",null,0,0,0,0,0,0,0,"",0]
["Markets",null,0,0,0,0,0,0,0,"",0]
["Stalls",null,0,0,0,0,0,0,0,"",0]
["Abattoirs",null,0,0,0,0,0,0,0,"",0]
["Airports",null,0,0,0,0,0,0,0,"",0]
["Taxi Ranks/Bus Terminals",null,0,0,0,0,0,0,0,"",0]
["Capital Spares",null,0,0,0,0,0,0,0,"",0]
["Sport and Recreation Facilities",null,{"$f":"SUM(C100:C102)","v":0},0,0,0,0,0,0,"",{"$f":"SUM(K100:K102)","v":0}]
["Indoor Facilities",null,null,null,null,null,null,null,0,""]
["Outdoor Facilities",null,null,null,null,null,null,null,{"$f":"H101-G101","v":0},{"$f":"IF(I101=0,\"\",I101/H101)","v":""}]
["Capital Spares",null,null,null,null,null,null,null,0,""]
["Heritage assets",null,{"$f":"SUM(C104:C108)","v":0},0,0,0,0,0,0,"",{"$f":"SUM(K104:K108)","v":0}]
["Monuments",null,null,null,null,null,null,null,0,""]
["Historic Buildings",null,null,null,null,null,null,null,0,""]
["Works of Art",null,null,null,null,null,null,null,0,""]
["Conservation Areas",null,null,null,null,null,null,null,0,""]
["Other Heritage",null,null,null,null,null,null,null,0,""]
[null,null,null,null,null,null,null,null,0,""]
["Investment properties",null,{"$f":"+C111+C114","v":0},0,0,0,0,0,0,"",{"$f":"+K111+K114","v":0}]
["Revenue Generating",null,{"$f":"SUM(C112:C113)","v":0},0,0,0,0,0,0,"",{"$f":"SUM(K112:K113)","v":0}]
["Improved Property",null,null,null,null,null,null,null,0,""]
["Unimproved Property",null,null,null,null,null,null,null,0,""]
["Non-revenue Generating",null,{"$f":"SUM(C115:C116)","v":0},0,0,0,0,0,0,"",{"$f":"SUM(K115:K116)","v":0}]
["Improved Property",null,null,null,null,null,null,null,0,""]
["Unimproved Property",null,null,null,null,null,null,null,{"$f":"H116-G116","v":0},{"$f":"IF(I116=0,\"\",I116/H116)","v":""}]
["Other assets",null,{"$f":"+C118+C130","v":5964321.3899999997},0,0,3248000,3248000,0,-3248000,{"$error":"#DIV/0!"},{"$f":"+K118+K130","v":0}]
["Operational Buildings",null,{"$f":"SUM(C119:C129)","v":5964321.3899999997},0,0,3248000,3248000,0,-3248000,{"$error":"#DIV/0!"},{"$f":"SUM(K119:K129)","v":0}]
["Municipal Offices",null,5964321.3899999997,0,0,3248000,3248000,0,-3248000,{"$error":"#DIV/0!"},0]
["Pay/Enquiry Points",null,0,0,0,0,0,0,0,"",0]
["Building Plan Offices",null,0,0,0,0,0,0,0,"",0]
["Workshops",null,0,0,0,0,0,0,0,"",0]
["Yards",null,0,0,0,0,0,0,0,"",0]
["Stores",null,0,0,0,0,0,0,0,"",0]
["Laboratories",null,0,0,0,0,0,0,0,"",0]
["Training Centres",null,0,0,0,0,0,0,0,"",0]
["Manufacturing Plant",null,0,0,0,0,0,0,0,"",0]
["Depots",null,0,0,0,0,0,0,0,"",0]
["Capital Spares",null,0,0,0,0,0,0,0,"",0]
["Housing",null,{"$f":"SUM(C131:C133)","v":0},0,0,0,0,0,0,"",{"$f":"SUM(K131:K133)","v":0}]
["Staff Housing",null,0,0,0,0,0,0,0,"",0]
["Social Housing",null,0,0,0,0,0,0,0,"",0]
["Capital Spares",null,0,0,0,0,0,0,0,"",0]
[null,null,null,null,null,null,null,null,null,""]
["Biological or Cultivated Assets",null,{"$f":"SUM(C136:C136)","v":6183000},9741941,9741941,0,0,5682803,{"$f":"H135-G135","v":5682803},1,{"$f":"SUM(K136)","v":9741941}]
["Biological or Cultivated Assets",null,6183000,9741941,9741941,0,0,5682803,{"$f":"H136-G136","v":5682803},1,9741941]
[null,null,null,null,null,null,null,null,null,{"$f":"IF(I137=0,\"\",I137/H137)","v":""}]
["Intangible Assets",null,{"$f":"SUM(C139:C140)","v":1396062.81},0,0,3250821,3250821,0,{"$f":"H138-G138","v":-3250821},{"$error":"#DIV/0!"},{"$f":"SUM(K139:K140)","v":0}]
["Servitudes",null,null,null,null,null,null,null,0,""]
["Licences and Rights",null,{"$f":"SUM(C141:C146)","v":1396062.81},0,0,3250821,3250821,0,-3250821,{"$error":"#DIV/0!"},{"$f":"SUM(K141:K146)","v":0}]
["Water Rights",null,null,null,null,null,null,null,0,""]
["Effluent Licenses",null,null,null,null,null,null,null,0,""]
["Solid Waste Licenses",null,null,null,null,null,null,null,0,""]
["Computer Software and Applications",null,1396062.81,0,0,3250821,3250821,0,-3250821,{"$error":"#DIV/0!"},0]
["Load Settlement Software Applications",null,null,null,null,null,null,null,0,""]
["Unspecified",null,0,0,0,0,0,0,0,"",0]
[]
["Computer Equipment",null,{"$f":"SUM(C149:C149)","v":13212024.390000001},47960853,47960853,0,0,27977173,{"$f":"H148-G148","v":27977173},{"$f":"IF(I148=0,\"\",I148/H148)","v":1},{"$f":"SUM(K149)","v":47960853}]
["Computer Equipment",null,13212024.390000001,47960853,47960853,0,0,27977173,{"$f":"H149-G149","v":27977173},{"$f":"IF(I149=0,\"\",I149/H149)","v":1},47960853]
[]
["Furniture and Office Equipment",null,{"$f":"SUM(C152:C152)","v":6207116.1699999999},47265806,47265806,1905569.75,1905569.75,27571754,{"$f":"H151-G151","v":25666184.25},{"$f":"IF(I151=0,\"\",I151/H151)","v":0.93088688699311617},{"$f":"SUM(K152)","v":47265806}]
["Furniture and Office Equipment",null,6207116.1699999999,47265806,47265806,1905569.75,1905569.75,27571754,{"$f":"H152-G152","v":25666184.25},{"$f":"IF(I152=0,\"\",I152/H152)","v":0.93088688699311617},47265806]
[null,null,null,null,null,null,null,null,null,{"$f":"IF(I153=0,\"\",I153/H153)","v":""}]
["Machinery and Equipment",null,{"$f":"SUM(C155:C155)","v":448965.41},427683,427683,487029.06,487029.06,249487,{"$f":"H154-G154","v":-237542.06},{"$f":"IF(I154=0,\"\",I154/H154)","v":-0.95212199433236999},{"$f":"SUM(K155)","v":427683}]
["Machinery and Equipment",null,448965.41,427683,427683,487029.06,487029.06,249487,{"$f":"H155-G155","v":-237542.06},{"$f":"IF(I155=0,\"\",I155/H155)","v":-0.95212199433236999},427683]
[]
["Transport Assets",null,{"$f":"SUM(C158:C158)","v":4067550.1},5250598,5250598,2834330.94,2834330.94,3062857,{"$f":"H157-G157","v":228526.06000000006},{"$f":"IF(I157=0,\"\",I157/H157)","v":7.461205665168176E-2},{"$f":"SUM(K158)","v":5250598}]
["Transport Assets",null,4067550.1,5250598,5250598,2834330.94,2834330.94,3062857,{"$f":"H158-G158","v":228526.06000000006},{"$f":"IF(I158=0,\"\",I158/H158)","v":7.461205665168176E-2},5250598]
[]
["Land",null,{"$f":"SUM(C161:C161)","v":0},0,0,0,0,0,{"$f":"H160-G160","v":0},{"$f":"IF(I160=0,\"\",I160/H160)","v":""},{"$f":"SUM(K161)","v":0}]
["Land",null,null,null,null,null,null,null,{"$f":"H161-G161","v":0},{"$f":"IF(I161=0,\"\",I161/H161)","v":""}]
[]
["Zoo's, Marine and Non-biological Animals",null,{"$f":"SUM(C164:C164)","v":0},0,0,0,0,0,{"$f":"H163-G163","v":0},{"$f":"IF(I163=0,\"\",I163/H163)","v":""},{"$f":"SUM(K164)","v":0}]
["Zoo's, Marine and Non-biological Animals",null,null,null,null,null,null,null,{"$f":"H164-G164","v":0},{"$f":"IF(I164=0,\"\",I164/H164)","v":""}]
[null,null,null,null,null,null,null,null,null,{"$f":"IF(I165=0,\"\",I165/H165)","v":""}]
["Total Depreciation",1,{"$f":"C7+C75+C103+C110+C117+C135+C138+C148+C151+C154+C157+C160+C163","v":146795994.86999997},133503316,133503316,77876911,77876911,77877002,91,1.168509285963525E-6,{"$f":"K7+K75+K103+K110+K117+K135+K138+K148+K151+K154+K157+K160+K163","v":133503316}]

{"sheet":"SC13e","index":33,"n_rows":171,"n_cols":11,"rows_kept":171,"cut":false,"hidden":false,"merged":[[0,0,0,10],[1,0,2,0],[1,1,2,1]]}
[{"$f":"muni& \" - \"&S71Se& \" - \"&Head57","v":"NW375 Moses Kotane - Supporting Table SC13e Monthly Budget Statement - capital expenditure on upgrading of existing assets by asset class - M07 January"}]
[{"$f":"desc","v":"Description"},{"$f":"head27","v":"Ref"},{"$f":"Head1","v":"2019/20"},{"$f":"Head2","v":"Budget Year 2020/21"}]
[null,null,{"$f":"Head5","v":"Audited Outcome"},{"$f":"Head6","v":"Original Budget"},{"$f":"Head7","v":"Adjusted Budget"},{"$f":"Head38","v":"Monthly actual"},{"$f":"Head39","v":"YearTD actual"},{"$f":"Head40","v":"YearTD budget"},{"$f":"Head41","v":"YTD variance"},{"$f":"Head41","v":"YTD variance"},{"$f":"Head8","v":"Full Year Forecast"}]
["R thousands",1,null,null,null,null,null,null,null,"%"]
["Capital expenditure on upgrading of existing assets by Asset Class/Sub-class"]
[]
["Infrastructure",null,{"$f":"C8+C13+C17+C27+C38+C45+C53+C63+C69","v":1862217.88},60981783,60981783,-2538353.94,23908066.43,35572719,{"$f":"H7-G7","v":11664652.57},{"$f":"IF(I7=0,\"\",I7/H7)","v":0.32791006417024238},{"$f":"K8+K13+K17+K27+K38+K45+K53+K63+K69","v":60981783}]
["Roads Infrastructure",null,{"$f":"SUM(C9:C12)","v":1862217.88},60981783,60981783,-2538353.94,23908066.43,35572719,11664652.57,0.32791006417024238,{"$f":"SUM(K9:K12)","v":60981783}]
["Roads",null,1862217.88,60981783,60981783,-2538353.94,23908066.43,35572719,11664652.57,0.32791006417024238,60981783]
["Road Structures",null,null,null,null,null,null,null,0,""]
["Road Furniture",null,null,null,null,null,null,null,0,""]
["Capital Spares",null,null,null,null,null,null,null,0,""]
["Storm water Infrastructure",null,{"$f":"SUM(C14:C16)","v":0},0,0,0,0,0,0,"",{"$f":"SUM(K14:K16)","v":0}]
["Drainage Collection",null,0,0,0,0,0,0,0,"",0]
["Storm water Conveyance",null,null,null,null,null,null,null,0,""]
["Attenuation",null,null,null,null,null,null,null,0,""]
["Electrical Infrastructure",null,{"$f":"SUM(C18:C26)","v":0},0,0,0,0,0,0,"",{"$f":"SUM(K18:K26)","v":0}]
["Power Plants",null,null,null,null,null,null,null,0,""]
["HV Substations",null,null,null,null,null,null,null,0,""]
["HV Switching Station",null,null,null,null,null,null,null,0,""]
["HV Transmission Conductors",null,null,null,null,null,null,null,0,""]
["MV Substations",null,null,null,null,null,null,null,0,""]
["MV Switching Stations",null,null,null,null,null,null,null,0,""]
["MV Networks",null,null,null,null,null,null,null,0,""]
["LV Networks",null,null,null,null,null,null,null,0,""]
["Capital Spares",null,null,null,null,null,null,null,0,""]
["Water Supply Infrastructure",null,{"$f":"SUM(C28:C37)","v":0},0,0,0,0,0,0,"",{"$f":"SUM(K28:K37)","v":0}]
["Dams and Weirs",null,null,null,null,null,null,null,0,""]
["Boreholes",null,null,null,null,null,null,null,0,""]
["Reservoirs",null,0,0,0,0,0,0,0,"",0]
["Pump Stations",null,null,null,null,null,null,null,0,""]
["Water Treatment Works",null,null,null,null,null,null,null,0,""]
["Bulk Mains",null,null,null,null,null,null,null,0,""]
["Distribution",null,null,null,null,null,null,null,0,""]
["Distribution Points",null,null,null,null,null,null,null,0,""]
["PRV Stations",null,null,null,null,null,null,null,0,""]
["Capital Spares",null,null,null,null,null,null,null,0,""]
["Sanitation Infrastructure",null,{"$f":"SUM(C39:C44)","v":0},0,0,0,0,0,0,"",{"$f":"SUM(K39:K44)","v":0}]
["Pump Station",null,null,null,null,null,null,null,0,""]
["Reticulation",null,null,null,null,null,null,null,0,""]
["Waste Water Treatment Works",null,null,null,null,null,null,null,0,""]
["Outfall Sewers",null,null,null,null,null,null,null,0,""]
["Toilet Facilities",null,null,null,null,null,null,null,0,""]
["Capital Spares",null,null,null,null,null,null,null,0,""]
["Solid Waste Infrastructure",null,{"$f":"SUM(C46:C52)","v":0},0,0,0,0,0,0,"",{"$f":"SUM(K46:K52)","v":0}]
["Landfill Sites",null,null,null,null,null,null,null,0,""]
["Waste Transfer Stations",null,null,null,null,null,null,null,0,""]
["Waste Processing Facilities",null,null,null,null,null,null,null,0,""]
["Waste Drop-off Points",null,null,null,null,null,null,null,0,""]
["Waste Separation Facilities",null,null,null,null,null,null,null,0,""]
["Electricity Generation Facilities",null,null,null,null,null,null,null,0,""]
["Capital Spares",null,null,null,null,null,null,null,0,""]
["Rail Infrastructure",null,{"$f":"SUM(C54:C62)","v":0},0,0,0,0,0,0,"",{"$f":"SUM(K54:K62)","v":0}]
["Rail Lines",null,null,null,null,null,null,null,0,""]
["Rail Structures",null,null,null,null,null,null,null,0,""]
["Rail Furniture",null,null,null,null,null,null,null,0,""]
["Drainage Collection",null,null,null,null,null,null,null,0,""]
["Storm water Conveyance",null,null,null,null,null,null,null,0,""]
["Attenuation",null,null,null,null,null,null,null,0,""]
["MV Substations",null,null,null,null,null,null,null,0,""]
["LV Networks",null,null,null,null,null,null,null,0,""]
["Capital Spares",null,null,null,null,null,null,null,0,""]
["Coastal Infrastructure",null,{"$f":"SUM(C64:C68)","v":0},0,0,0,0,0,0,"",{"$f":"SUM(K64:K68)","v":0}]
["Sand Pumps",null,null,null,null,null,null,null,0,""]
["Piers",null,null,null,null,null,null,null,0,""]
["Revetments",null,null,null,null,null,null,null,0,""]
["Promenades",null,null,null,null,null,null,null,0,""]
["Capital Spares",null,null,null,null,null,null,null,0,""]
["Information and Communication Infrastructure",null,{"$f":"SUM(C70:C73)","v":0},0,0,0,0,0,0,"",{"$f":"SUM(K70:K73)","v":0}]
["Data Centres",null,null,null,null,null,null,null,0,""]
["Core Layers",null,null,null,null,null,null,null,0,""]
["Distribution Layers",null,null,null,null,null,null,null,0,""]
["Capital Spares",null,null,null,null,null,null,null,0,""]
[null,null,null,null,null,null,null,null,null,""]
["Community Assets",null,{"$f":"+C76+C99","v":0},0,0,0,0,0,0,"",{"$f":"+K76+K99","v":0}]
["Community Facilities",null,{"$f":"SUM(C77:C98)","v":0},0,0,0,0,0,0,"",{"$f":"SUM(K77:K98)","v":0}]
["Halls",null,null,null,null,null,null,null,0,""]
["Centres",null,null,null,null,null,null,null,0,""]
["Crèches",null,null,null,null,null,null,null,0,""]
["Clinics/Care Centres",null,null,null,null,null,null,null,0,""]
["Fire/Ambulance Stations",null,null,null,null,null,null,null,0,""]
["Testing Stations",null,null,null,null,null,null,null,0,""]
["Museums",null,null,null,null,null,null,null,0,""]
["Galleries",null,null,null,null,null,null,null,0,""]
["Theatres",null,null,null,null,null,null,null,0,""]
["Libraries",null,null,null,null,null,null,null,0,""]
["Cemeteries/Crematoria",null,null,null,null,null,null,null,0,""]
["Police",null,null,null,null,null,null,null,0,""]
["Purls",null,null,null,null,null,null,null,0,""]
["Public Open Space",null,null,null,null,null,null,null,0,""]
["Nature Reserves",null,null,null,null,null,null,null,0,""]
["Public Ablution Facilities",null,null,null,null,null,null,null,0,""]
["Markets",null,null,null,null,null,null,null,0,""]
["Stalls",null,null,null,null,null,null,null,0,""]
["Abattoirs",null,null,null,null,null,null,null,0,""]
["Airports",null,null,null,null,null,null,null,0,""]
["Taxi Ranks/Bus Terminals",null,null,null,null,null,null,null,0,""]
["Capital Spares",null,null,null,null,null,null,null,0,""]
["Sport and Recreation Facilities",null,{"$f":"SUM(C100:C102)","v":0},0,0,0,0,0,0,"",{"$f":"SUM(K100:K102)","v":0}]
["Indoor Facilities",null,null,null,null,null,null,null,0,""]
["Outdoor Facilities",null,null,null,null,null,null,null,{"$f":"H101-G101","v":0},{"$f":"IF(I101=0,\"\",I101/H101)","v":""}]
["Capital Spares",null,null,null,null,null,null,null,0,""]
["Heritage assets",null,{"$f":"SUM(C104:C108)","v":0},0,0,0,0,0,0,"",{"$f":"SUM(K104:K108)","v":0}]
["Monuments",null,null,null,null,null,null,null,0,""]
["Historic Buildings",null,null,null,null,null,null,null,0,""]
["Works of Art",null,null,null,null,null,null,null,0,""]
["Conservation Areas",null,null,null,null,null,null,null,0,""]
["Other Heritage",null,null,null,null,null,null,null,0,""]
[null,null,null,null,null,null,null,null,0,""]
["Investment properties",null,{"$f":"+C111+C114","v":0},0,0,0,0,0,0,"",{"$f":"+K111+K114","v":0}]
["Revenue Generating",null,{"$f":"SUM(C112:C113)","v":0},0,0,0,0,0,0,"",{"$f":"SUM(K112:K113)","v":0}]
["Improved Property",null,null,null,null,null,null,null,0,""]
["Unimproved Property",null,null,null,null,null,null,null,0,""]
["Non-revenue Generating",null,{"$f":"SUM(C115:C116)","v":0},0,0,0,0,0,0,"",{"$f":"SUM(K115:K116)","v":0}]
["Improved Property",null,null,null,null,null,null,null,0,""]
["Unimproved Property",null,null,null,null,null,null,null,{"$f":"H116-G116","v":0},{"$f":"IF(I116=0,\"\",I116/H116)","v":""}]
["Other assets",null,{"$f":"+C118+C130","v":0},0,0,0,0,0,0,"",{"$f":"+K118+K130","v":0}]
["Operational Buildings",null,{"$f":"SUM(C119:C129)","v":0},0,0,0,0,0,0,"",{"$f":"SUM(K119:K129)","v":0}]
["Municipal Offices",null,null,null,null,null,null,null,0,""]
["Pay/Enquiry Points",null,null,null,null,null,null,null,0,""]
["Building Plan Offices",null,null,null,null,null,null,null,0,""]
["Workshops",null,null,null,null,null,null,null,0,""]
["Yards",null,null,null,null,null,null,null,0,""]
["Stores",null,null,null,null,null,null,null,0,""]
["Laboratories",null,null,null,null,null,null,null,0,""]
["Training Centres",null,null,null,null,null,null,null,0,""]
["Manufacturing Plant",null,null,null,null,null,null,null,0,""]
["Depots",null,null,null,null,null,null,null,0,""]
["Capital Spares",null,null,null,null,null,null,null,0,""]
["Housing",null,{"$f":"SUM(C131:C133)","v":0},0,0,0,0,0,0,"",{"$f":"SUM(K131:K133)","v":0}]
["Staff Housing",null,null,null,null,null,null,null,0,""]
["Social Housing",null,null,null,null,null,null,null,0,""]
["Capital Spares",null,null,null,null,null,null,null,0,""]
[null,null,null,null,null,null,null,null,null,""]
["Biological or Cultivated Assets",null,{"$f":"SUM(C136:C136)","v":0},0,0,0,0,0,{"$f":"H135-G135","v":0},"",{"$f":"SUM(K136)","v":0}]
["Biological or Cultivated Assets",null,null,null,null,null,null,null,{"$f":"H136-G136","v":0},""]
[null,null,null,null,null,null,null,null,null,{"$f":"IF(I137=0,\"\",I137/H137)","v":""}]
["Intangible Assets",null,{"$f":"SUM(C139:C140)","v":0},0,0,0,0,0,{"$f":"H138-G138","v":0},"",{"$f":"SUM(K139:K140)","v":0}]
["Servitudes",null,null,null,null,null,null,null,0,""]
["Licences and Rights",null,{"$f":"SUM(C141:C146)","v":0},0,0,0,0,0,0,"",{"$f":"SUM(K141:K146)","v":0}]
["Water Rights",null,null,null,null,null,null,null,0,""]
["Effluent Licenses",null,null,null,null,null,null,null,0,""]
["Solid Waste Licenses",null,null,null,null,null,null,null,0,""]
["Computer Software and Applications",null,null,null,null,null,null,null,0,""]
["Load Settlement Software Applications",null,null,null,null,null,null,null,0,""]
["Unspecified",null,null,null,null,null,null,null,0,""]
[]
["Computer Equipment",null,{"$f":"SUM(C149:C149)","v":0},0,0,0,0,0,{"$f":"H148-G148","v":0},{"$f":"IF(I148=0,\"\",I148/H148)","v":""},{"$f":"SUM(K149)","v":0}]
["Computer Equipment",null,null,null,null,null,null,null,{"$f":"H149-G149","v":0},{"$f":"IF(I149=0,\"\",I149/H149)","v":""}]
[]
["Furniture and Office Equipment",null,{"$f":"SUM(C152:C152)","v":0},0,0,0,0,0,{"$f":"H151-G151","v":0},{"$f":"IF(I151=0,\"\",I151/H151)","v":""},{"$f":"SUM(K152)","v":0}]
["Furniture and Office Equipment",null,null,null,null,null,null,null,{"$f":"H152-G152","v":0},{"$f":"IF(I152=0,\"\",I152/H152)","v":""}]
[null,null,null,null,null,null,null,null,null,{"$f":"IF(I153=0,\"\",I153/H153)","v":""}]
["Machinery and Equipment",null,{"$f":"SUM(C155:C155)","v":0},0,0,0,0,0,{"$f":"H154-G154","v":0},{"$f":"IF(I154=0,\"\",I154/H154)","v":""},{"$f":"SUM(K155)","v":0}]
["Machinery and Equipment",null,null,null,null,null,null,null,{"$f":"H155-G155","v":0},{"$f":"IF(I155=0,\"\",I155/H155)","v":""}]
[]
["Transport Assets",null,{"$f":"SUM(C158:C158)","v":0},0,0,0,0,0,{"$f":"H157-G157","v":0},{"$f":"IF(I157=0,\"\",I157/H157)","v":""},{"$f":"SUM(K158)","v":0}]
["Transport Assets",null,null,null,null,null,null,null,{"$f":"H158-G158","v":0},{"$f":"IF(I158=0,\"\",I158/H158)","v":""}]
[]
["Land",null,{"$f":"SUM(C161:C161)","v":0},0,0,0,0,0,{"$f":"H160-G160","v":0},{"$f":"IF(I160=0,\"\",I160/H160)","v":""},{"$f":"SUM(K161)","v":0}]
["Land",null,null,null,null,null,null,null,{"$f":"H161-G161","v":0},{"$f":"IF(I161=0,\"\",I161/H161)","v":""}]
[null,null,null,null,null,null,null,null,null,"."]
["Zoo's, Marine and Non-biological Animals",null,{"$f":"SUM(C164:C164)","v":0},0,0,0,0,0,{"$f":"H163-G163","v":0},{"$f":"IF(I163=0,\"\",I163/H163)","v":""},{"$f":"SUM(K164)","v":0}]
["Zoo's, Marine and Non-biological Animals",null,null,null,null,null,null,null,{"$f":"H164-G164","v":0},{"$f":"IF(I164=0,\"\",I164/H164)","v":""}]
[null,null,null,null,null,null,null,null,null,{"$f":"IF(I165=0,\"\",I165/H165)","v":""}]
["Total Capital Expenditure on upgrading of existing assets ",1,{"$f":"C7+C75+C103+C110+C117+C135+C138+C148+C151+C154+C157+C160+C163","v":1862217.88},60981783,60981783,-2538353.94,23908066.43,35572719,{"$f":"H166-G166","v":11664652.57},{"$f":"IF(I166=0,\"\",I166/H166)","v":0.32791006417024238},{"$f":"K7+K75+K103+K110+K117+K135+K138+K148+K151+K154+K157+K160+K163","v":60981783}]
[]
[{"$f":"head27a","v":"References"}]
["1. Total Capital Expenditure on new assets (SC13a) plus Total Capital Expenditure on renewal of existing assets (SC13b) plus Total Capital Expenditure on upgrading of existing assets (SC13e)  must reconcile to total capital expenditure in Table C5"]
[]
["check balance",null,{"$f":"C166+SC13a!C166+SC13b!C166-'C5-Capex'!C40","v":0},{"$f":"D166+SC13a!D166+SC13b!D166-'C5-Capex'!D40","v":0},{"$f":"E166+SC13a!E166+SC13b!E166-'C5-Capex'!E40","v":0},{"$f":"F166+SC13a!F166+SC13b!F166-'C5-Capex'!F40","v":0},{"$f":"G166+SC13a!G166+SC13b!G166-'C5-Capex'!G40","v":0},{"$f":"H166+SC13a!H166+SC13b!H166-'C5-Capex'!H40","v":0},null,null,{"$f":"K166+SC13a!K166+SC13b!K166-'C5-Capex'!K40","v":0}]

{"sheet":"SC71charts","index":34,"n_rows":104,"n_cols":10,"rows_kept":104,"cut":false,"hidden":false,"merged":[]}
[{"$f":"'Template names'!B102","v":"Chart C1 2020/21 Capital Expenditure Monthly Trend: actual v target"}]
["Month",{"$f":"'SC12'!B2","v":"2019/20"},{"$f":"'SC12'!C3","v":"Original Budget"},{"$f":"'SC12'!D3","v":"Adjusted Budget"},{"$f":"'SC12'!E3","v":"Monthly actual"}]
[{"$f":"LEFT('SC12'!A6,3)","v":"Jul"},{"$f":"'SC12'!B6","v":456868.82},{"$f":"'SC12'!C6","v":16957936.09},{"$f":"'SC12'!D6","v":16957953},{"$f":"'SC12'!E6","v":6132272.3200000003}]
[{"$f":"LEFT('SC12'!A7,3)","v":"Aug"},{"$f":"'SC12'!B7","v":15381965.960000001},{"$f":"'SC12'!C7","v":16957936.09},{"$f":"'SC12'!D7","v":16957953},{"$f":"'SC12'!E7","v":12746732.560000001}]
[{"$f":"LEFT('SC12'!A8,3)","v":"Sep"},{"$f":"'SC12'!B8","v":7655673.5800000001},{"$f":"'SC12'!C8","v":16957936.09},{"$f":"'SC12'!D8","v":16957953},{"$f":"'SC12'!E8","v":6595187.1299999999}]
[{"$f":"LEFT('SC12'!A9,3)","v":"Oct"},{"$f":"'SC12'!B9","v":9883858.1899999995},{"$f":"'SC12'!C9","v":16957936.09},{"$f":"'SC12'!D9","v":16957953},{"$f":"'SC12'!E9","v":6350586.9000000004}]
[{"$f":"LEFT('SC12'!A10,3)","v":"Nov"},{"$f":"'SC12'!B10","v":12336810.07},{"$f":"'SC12'!C10","v":16957936.09},{"$f":"'SC12'!D10","v":16957953},{"$f":"'SC12'!E10","v":-247188.91}]
[{"$f":"LEFT('SC12'!A11,3)","v":"Dec"},{"$f":"'SC12'!B11","v":19986773.059999999},{"$f":"'SC12'!C11","v":16957936.09},{"$f":"'SC12'!D11","v":16957953},{"$f":"'SC12'!E11","v":34705421.409999996}]
[{"$f":"LEFT('SC12'!A12,3)","v":"Jan"},{"$f":"'SC12'!B12","v":12180241.449999999},{"$f":"'SC12'!C12","v":16957936.09},{"$f":"'SC12'!D12","v":16957953},{"$f":"'SC12'!E12","v":6904946.1900000004}]
[{"$f":"LEFT('SC12'!A13,3)","v":"Feb"},{"$f":"'SC12'!B13","v":9130612.4199999999},{"$f":"'SC12'!C13","v":16957936.09},{"$f":"'SC12'!D13","v":16957953},{"$f":"'SC12'!E13","v":0}]
[{"$f":"LEFT('SC12'!A14,3)","v":"Mar"},{"$f":"'SC12'!B14","v":11503317.720000001},{"$f":"'SC12'!C14","v":16957936.09},{"$f":"'SC12'!D14","v":16957953},{"$f":"'SC12'!E14","v":0}]
[{"$f":"LEFT('SC12'!A15,3)","v":"Apr"},{"$f":"'SC12'!B15","v":3905991.8},{"$f":"'SC12'!C15","v":16957936.09},{"$f":"'SC12'!D15","v":16957953},{"$f":"'SC12'!E15","v":0}]
[{"$f":"LEFT('SC12'!A16,3)","v":"May"},{"$f":"'SC12'!B16","v":7347078.2699999996},{"$f":"'SC12'!C16","v":16957936.09},{"$f":"'SC12'!D16","v":16957953},{"$f":"'SC12'!E16","v":0}]
[{"$f":"LEFT('SC12'!A17,3)","v":"Jun"},{"$f":"'SC12'!B17","v":26876111.309999999},{"$f":"'SC12'!C17","v":16957936.010000002},{"$f":"'SC12'!D17","v":16957750},{"$f":"'SC12'!E17","v":0}]
[]
[]
[]
[]
[]
[]
[]
[]
[]
[]
[]
[{"$f":"'Template names'!B103","v":"Chart C2 2020/21 Capital Expenditure: YTD actual v YTD target"}]
["Month",{"$f":"'SC12'!F3","v":"YearTD actual"},{"$f":"'SC12'!G3","v":"YearTD budget"}]
[{"$f":"LEFT('SC12'!A6,3)","v":"Jul"},{"$f":"'SC12'!F6","v":6132272.3200000003},{"$f":"'SC12'!G6","v":16957953}]
[{"$f":"LEFT('SC12'!A7,3)","v":"Aug"},{"$f":"'SC12'!F7","v":18879004.880000003},{"$f":"'SC12'!G7","v":33915906}]
[{"$f":"LEFT('SC12'!A8,3)","v":"Sep"},{"$f":"'SC12'!F8","v":25474192.010000002},{"$f":"'SC12'!G8","v":50873859}]
[{"$f":"LEFT('SC12'!A9,3)","v":"Oct"},{"$f":"'SC12'!F9","v":31824778.910000004},{"$f":"'SC12'!G9","v":67831812}]
[{"$f":"LEFT('SC12'!A10,3)","v":"Nov"},{"$f":"'SC12'!F10","v":""},{"$f":"'SC12'!G10","v":84789765}]
[{"$f":"LEFT('SC12'!A11,3)","v":"Dec"},{"$f":"'SC12'!F11","v":{"$error":"#VALUE!"}},{"$f":"'SC12'!G11","v":101747718}]
[{"$f":"LEFT('SC12'!A12,3)","v":"Jan"},{"$f":"'SC12'!F12","v":{"$error":"#VALUE!"}},{"$f":"'SC12'!G12","v":118705671}]
[{"$f":"LEFT('SC12'!A13,3)","v":"Feb"},{"$f":"'SC12'!F13","v":""},{"$f":"'SC12'!G13","v":135663624}]
[{"$f":"LEFT('SC12'!A14,3)","v":"Mar"},{"$f":"'SC12'!F14","v":""},{"$f":"'SC12'!G14","v":152621577}]
[{"$f":"LEFT('SC12'!A15,3)","v":"Apr"},{"$f":"'SC12'!F15","v":""},{"$f":"'SC12'!G15","v":169579530}]
[{"$f":"LEFT('SC12'!A16,3)","v":"May"},{"$f":"'SC12'!F16","v":""},{"$f":"'SC12'!G16","v":186537483}]
[{"$f":"LEFT('SC12'!A17,3)","v":"Jun"},{"$f":"'SC12'!F17","v":""},{"$f":"'SC12'!G17","v":203495233}]
[]
[]
[]
[]
[]
[]
[]
[]
[]
[]
[]
[{"$f":"'Template names'!B104","v":"Chart C3 Aged Consumer Debtors Analysis"}]
[null,{"$f":"'SC3'!C3","v":"0-30 Days"},{"$f":"'SC3'!D3","v":"31-60 Days"},{"$f":"'SC3'!E3","v":"61-90 Days"},{"$f":"'SC3'!F3","v":"91-120 Days"},{"$f":"'SC3'!G3","v":"121-150 Dys"},{"$f":"'SC3'!H3","v":"151-180 Dys"},{"$f":"'SC3'!I3","v":"181 Dys-1 Yr"},{"$f":"'SC3'!J3","v":"Over 1Yr"}]
[{"$f":"Head2","v":"Budget Year 2020/21"},{"$f":"'SC3'!C14","v":75402115},{"$f":"'SC3'!D14","v":32977160},{"$f":"'SC3'!E14","v":32419706},{"$f":"'SC3'!F14","v":33402540},{"$f":"'SC3'!G14","v":28779214},{"$f":"'SC3'!H14","v":25344132},{"$f":"'SC3'!I14","v":162478680},{"$f":"'SC3'!J14","v":989283789}]
[{"$f":"Head1","v":"2019/20"},{"$f":"'SC3'!C15","v":0},{"$f":"'SC3'!D15","v":0},{"$f":"'SC3'!E15","v":0},{"$f":"'SC3'!F15","v":0},{"$f":"'SC3'!G15","v":0},{"$f":"'SC3'!H15","v":0},{"$f":"'SC3'!I15","v":0},{"$f":"'SC3'!J15","v":0}]
[]
[]
[]
[]
[]
[]
[]
[]
[]
[]
[]
[]
[]
[]
[]
[]
[]
[]
[]
[]
[]
[{"$f":"'Template names'!B105","v":"Chart C4 Consumer Debtors (total by Debtor Customer Category)"}]
[null,{"$f":"Head1","v":"2019/20"},{"$f":"Head2","v":"Budget Year 2020/21"}]
[{"$f":"'SC3'!A17","v":"Organs of State"},{"$f":"C78*0.97","v":188749966.18000001},{"$f":"'SC3'!K17","v":194587594}]
[{"$f":"'SC3'!A18","v":"Commercial"},{"$f":"C79*0.97","v":252312177.59},{"$f":"'SC3'!K18","v":260115647}]
[{"$f":"'SC3'!A19","v":"Households"},{"$f":"C80*0.97","v":890162148.88999999},{"$f":"'SC3'!K19","v":917692937}]
[{"$f":"'SC3'!A20","v":"Other"},{"$f":"C81*0.97","v":7460423.2599999998},{"$f":"'SC3'!K20","v":7691158}]
[]
[]
[]
[]
[]
[]
[]
[]
[]
[]
[]
[]
[]
[]
[]
[]
[]
[]
[]
[{"$f":"'Template names'!B106","v":"Chart C5 Aged Creditors Analysis"}]
[null,{"$f":"'SC4'!A6","v":"Bulk Electricity"},{"$f":"'SC4'!A7","v":"Bulk Water"},{"$f":"'SC4'!A8","v":"PAYE deductions"},{"$f":"'SC4'!A9","v":"VAT (output less input)"},{"$f":"'SC4'!A10","v":"Pensions / Retirement deductions"},{"$f":"'SC4'!A11","v":"Loan repayments"},{"$f":"'SC4'!A12","v":"Trade Creditors"},{"$f":"'SC4'!A13","v":"Auditor General"},{"$f":"'SC4'!A14","v":"Other"}]
[{"$f":"A54","v":"2019/20"},{"$f":"'SC4'!L6","v":0},{"$f":"'SC4'!L7","v":0},{"$f":"'SC4'!L8","v":0},{"$f":"'SC4'!L9","v":0},{"$f":"'SC4'!L10","v":0},{"$f":"'SC4'!L11","v":0},{"$f":"'SC4'!L12","v":4287261.84},{"$f":"'SC4'!L13","v":0},{"$f":"'SC4'!L14","v":0}]
[{"$f":"A53","v":"Budget Year 2020/21"},{"$f":"'SC4'!K6","v":8049671.46},{"$f":"'SC4'!K7","v":0},{"$f":"'SC4'!K8","v":0},{"$f":"'SC4'!K9","v":0},{"$f":"'SC4'!K10","v":0},{"$f":"'SC4'!K11","v":0},{"$f":"'SC4'!K12","v":0},{"$f":"'SC4'!K13","v":0},{"$f":"'SC4'!K14","v":0}]